[kdepim-runtime] resources/kolabproxy/tests: Use AkonadiMacros for kolabproxy tests.

Christoph Feck christoph at maxiom.de
Sat Nov 2 18:52:49 UTC 2013

On Saturday 02 November 2013 13:43:45 Christian Mollekopf wrote:
> Git commit 87e8eb55c03ce184d0dae937327969aac2c5141d by Christian
> Mollekopf. Committed on 02/11/2013 at 12:43.
> Pushed by cmollekopf into branch 'master'.
> Use AkonadiMacros for kolabproxy tests.
> This should fix the build on build.kde.org

The build that fails there is the kdepim-runtime/4.11 branch. Please 
fix as soon as possible, because the 4.11.3 release is made from this 

Error is (see http://build.kde.org/view/FAILED/ ):

linux/bin/ld: cannot find -lakonadi-kde
linux/bin/ld: cannot find -lakonadi-kmime
collect2: error: ld returned 1 exit status
make[2]: *** [resources/kolabproxy/tests/proxyintegrationtest] Error 1

Christoph Feck (kdepepo)
KDE Quality Team

More information about the release-team mailing list