KDevelop 3.1.1 build problem

Steven Suson suson at TuckerEnergy.com
Sat Oct 23 01:15:07 BST 2004

Greetings all,

    I am currently having problems building KDevelop on a highly updated 
Redhat 9, using KDE 3.3.1 (all other packages built and installed), gcc 
3.2.2. The error is as follows:

/bin/sh ../../libtool --silent --mode=compile --tag=CXX g++ 
-DHAVE_CONFIG_H -I. -I. -I../.. -I../../lib/interfaces -I../../lib/util 
-I/usr/include/kde -I/usr/lib/qt-3.3/include -I/usr/X11R6/include   
-DQT_THREAD_SUPPORT  -D_REENTRANT  -Wnon-virtual-dtor -Wno-long-long 
-Wundef -ansi -D_XOPEN_SOURCE=500 -D_BSD_SOURCE -Wcast-align 
-Wconversion -Wchar-subscripts -Wall -W -Wpointer-arith -Wwrite-strings 
-O2 -O2 -g -pipe -march=i686 -Wformat-security 
-Wmissing-format-attribute -fno-exceptions -fno-check-new -fno-common 
-DQT_NO_TRANSLATION  -c -o cvspartimpl.lo `test -f 'cvspartimpl.cpp' || 
echo './'`cvspartimpl.cpp
cvspartimpl.cpp: In member function `virtual bool
cvspartimpl.cpp:368: no matching function for call to `CvsService_stub::
   checkout(QString, QString, QString, QString, bool, bool)'
/usr/include/kde/cvsservice_stub.h:27: candidates are: virtual DCOPRef
   CvsService_stub::checkout(const QString&, const QString&, const QString&,
   const QString&, bool)
make[3]: *** [cvspartimpl.lo] Error 1
make[3]: Leaving directory 
make[2]: *** [all-recursive] Error 1
make[2]: Leaving directory `/usr/src/redhat/BUILD/kdevelop-3.1.1/vcs'
make[1]: *** [all-recursive] Error 1
make[1]: Leaving directory `/usr/src/redhat/BUILD/kdevelop-3.1.1'
make: *** [all] Error 2

    This seems to stem from the macro KDE_IS_VERSION(3,2,90) not 
returning true, and therefore the wrong calls being made. If you need 
any more information, please let me know. Any ideas?

Thanks in advance,
Steven Suson

to unsubscribe from this list send an email to kdevelop-request at kdevelop.org with the following body:
unsubscribe »your-email-address«

More information about the KDevelop mailing list