Problems with a kde-java project

Richard Stevens mail at richardstevens.de
Mon Feb 23 08:45:42 UTC 2004


-----BEGIN PGP SIGNED MESSAGE-----
Hash: SHA1

Hi,

I'm having trouble getting a newly created JAVA-KDE-Application Framework
project to compile with KDevelop 3.0.1. I'm new to this, so there might be an
error on my side.

It seems that not all the placeholders @something@ are replaced when calling
the auto* toolchain and configure. At least @JAVAH@, @JAVAC@ and @JAR@ remain
placeholders. This leads to the following output:


gmake[2]: Nothing to be done for `all'.
*/bin/sh: line 1: @JAVAC@: command not found
*Making all in src
*gmake[2]: *** [classjava.stamp] Error 127
*gmake[2]: Target `all' not remade because of errors.
*CLASSPATH=.:/home/rst/_Programme/jtest2/src/.:$CLASSPATH @JAVAC@ -d .
jtest2.java jtest2View.java jtest2Preferences.java
*gmake[1]: *** [all-recursive] Error 1
*gmake: *** [all] Error 2
**** Exited with status: 2 ***

Also I noticed that there doesn't seem to be any checks for java stuff running
configure. Is that intentional?

Is there a problem with the template or do I have to configure something? If I
need to add some settings, could you give me a hint on where to do it or
where to read about it? I wasn't able to find something yet.

Regards,

Richard
-----BEGIN PGP SIGNATURE-----
Version: GnuPG v1.2.3 (GNU/Linux)

iD8DBQFAOb22CfA4EwqVdIQRArANAKDf/uTnvA7Iu9xcLgQ7hwP+btkcQACbBFpD
xcrQ1Y+EVtdotKznqk/lprI=
=4L4v
-----END PGP SIGNATURE-----

-
to unsubscribe from this list send an email to kdevelop-request at kdevelop.org with the following body:
unsubscribe »your-email-address«



More information about the KDevelop mailing list