Problems compiling kdevelop (030916)

Markus Oley markus.oley at cse.de
Wed Sep 17 11:36:32 UTC 2003


Hello to everyone, 

I tried to compile kdevelop and recieved this error:

./.libs/libkdevcppsupport.a: could not read symbols: Archive has no index; run 
ranlib to add one
collect2: ld returned 1 exit status
make[4]: *** [r++] Error 1
make[3]: *** [all-recursive] Error 1
make[2]: *** [all-recursive] Error 1
make[1]: *** [all-recursive] Error 1
make: *** [all] Error 2

I´m using KDE 3.1 and QT3.1.1, what does go wrong? 

file libkdevcppsupport.a says:
libkdevcppsupport.a: current ar archive

I don´t know why it compiles it in an unix-like way. 

Can you help me fixing this ?

Greetings 
MAO


-
to unsubscribe from this list send an email to kdevelop-request at kdevelop.org with the following body:
unsubscribe »your-email-address«



More information about the KDevelop mailing list