Error while autoconf/automake

Frank Werner develop at
Mon Oct 15 13:14:10 BST 2001

Hi There,

since today, I get the following error from autoconf when I try to generate a 
new project in kdevelop 2.0.1.

This Makefile is only for the CVS repository
This will be deleted before making the distribution

*** Creating acinclude.m4
!!! If you get recursion errors from autoconf, it is advisable to set the
    environment variable M4 to something including "--nesting-limit=500"
*** Creating aclocal.m4
*** Creating configure
./aclocal.m4:2509: error: m4_defn: undefined macro: _m4_divert_diversion
acfunctions.m4:1108: AM_FUNC_OBSTACK is expanded from...
./aclocal.m4:2509: the top level
make[1]: *** [cvs] Error 1
make: *** [all] Error 2
*** fehlgeschlagen ***

The only one thing I modified my system is to update autoconf from 1.4 to 
1.5. I tryed downgrading autoconf to 1.4, but the error is the same.

Can someone help me, where I have to look for, to solve this error?

Thanks in advance.


to unsubscribe from this list send an email to kdevelop-request at with the following body:
unsubscribe »your-email-address«

More information about the KDevelop mailing list