Error while generating new project

Cristian Antonioli- Simona Stefani cristian.simona at
Mon Oct 8 20:42:06 BST 2001

Package:            kdevelop
Version:             1.4.1 (KDE 2.1.2)
Severity:             normal
Installed from:     Slackware 8.0
Compiler:           gcc version 2.95.2
OS:                   Linux 2.4.5 i686

I've got this error while generating a new project and when i choose
"Automake and Autoconf" from the Project menu

This Makefile is only for the CVS repository
This will be deleted before making the distribution

*** Concatenating configure tests into acinclude.m4
*** Creating list of subdirectories in subdirs
*** Searching for subdirectories...
*** Retrieving configure tests needed by
*** Scanning for include statements
autoheader: error while sourcing /tmp/u8876/
gmake[1]: *** [cvs] Error 1
gmake: *** [all] Error 2
./configure: file not found

to unsubscribe from this list send an email to kdevelop-request at with the following body:
unsubscribe »your-email-address«

More information about the KDevelop mailing list