BIG problems today!! (*need help*)

Thorsten Schnebeck schnebeck at mail.ifw.uni-hannover.de
Thu Jun 14 10:34:42 UTC 2001


Hi!

After installling the latest kdelib-cvs for testing khtml-bugs (kdebase-cvs 
is broken and was not installed) I can not start kdevelop-1.4-tree-CVS any 
longer. Cause all my backups down to 1.4_release shows the same inconsistency 
it seems more a kdelib problem. But maybe someone in this group can help me! 
(*PLEASE*) 

schnebeck at b4-413-d122:~ > kdevelop
kdecore (KAccel): WARNING: cannot connect action Mittels grep suchen which is 
not in the object dictionary DocViewMan::installBMPopup QObject::connect: 
Incompatible sender/receiver arguments         QSignal::x(int) --> 
CKDevelop::slotHelpTipOfDay(bool) QGList::locate: Index 0 out of range 
QGList::locate: Index 0 out of range QGList::locate: Index 1 out of range 
QGList::locate: Index 1 out of range QGList::locate: Index 2 out of range 
QGList::locate: Index 2 out of range QGList::locate: Index 3 out of range 
QGList::locate: Index 3 out of range QGList::locate: Index 4 out of range 
QGList::locate: Index 4 out of range kdevelop: error while loading shared 
libraries: kdevelop: undefined symbol: yywrap
schnebeck at b4-413-d122:~ >

So, I start the compilation of kdevelop (no new check-out) which yesterday 
worked pretty well:

[...]
make[3]: Entering directory `/opt/kde2/progs/kdevelop/kdevelop/tools'
make[3]: Nothing to be done for `all'.
make[3]: Leaving directory `/opt/kde2/progs/kdevelop/kdevelop/tools'
Making all in vc
make[3]: Entering directory `/opt/kde2/progs/kdevelop/kdevelop/vc'
make[3]: Nothing to be done for `all'.
make[3]: Leaving directory `/opt/kde2/progs/kdevelop/kdevelop/vc'
make[3]: Entering directory `/opt/kde2/progs/kdevelop/kdevelop'
Makefile:944: warning: overriding commands for target `ktipofdaydlg.moc'
Makefile:880: warning: ignoring old commands for target `ktipofdaydlg.moc'
Makefile:1036: warning: overriding commands for target `wzconnectdlg.moc'
Makefile:869: warning: ignoring old commands for target `wzconnectdlg.moc'
/bin/sh ../libtool --mode=link --tag=CXX g++  -O2 -fno-exceptions 
-fno-check-new -Wall -pedantic -W -Wpointer-arith -Wmissing-prototypes 
-Wwrite-strings -Wno-long-long -Wnon-virtual-dtor -fno-builtin   -o kdevelop 
-L/usr/X11R6/lib -L/usr/lib/qt2/lib -L/opt/kde2/lib  -R /opt/kde2/lib -R 
/usr/lib/qt2/lib -R /usr/X11R6/lib cerrormessageparser.o ckdevelop.o 
ckdevelop_classview.o ckdevelop_noslot.o cprjoptionsdlg.o ckappwizard.o 
ckdevelop_init.o main.o ktipofday.o kstartuplogo.o klangcombo.o 
kdevlistview.o grepdialog.o doctreeview.o dbgtoolbar.o dbgpsdlg.o 
cupdatekdedocdlg.o ctreeview.o ctreehandler.o ctoolsconfigdlg.o ctoolclass.o 
ctabctl.o crealfileview.o cproject.o coutputwidget.o cnewfiledlg.o 
cnewclassdlg.o cmakemanualdlgdata.o cmakemanualdlg.o clogfileview.o 
ckdevsetupdlg.o ckdevinstall.o ckdevelop_whatsthis.o ckdevelop_project.o 
cclasstreehandler.o ckdevaccel.o cgrouppropertiesdlg.o cgeneratenewfile.o 
cfinddoctextdlg.o cfilepropdlg.o cexecuteargdlg.o ceditwidget.o 
cdoctreepropdlg.o cdocbrowser.o ccvaddfolderdlg.o ccreatedocdatabasedlg.o 
cclonefunctiondlg.o cclassview.o wzconnectdlgimpl.o cclasstooltreeview.o 
cclasstooldlg.o caddnewtranslationdlg.o caddexistingfiledlg.o 
caddclassmethoddlg.o caddclassattributedlg.o wzconnectdlg.o ktipofdaydlg.o 
wzconnectdlgimpl.moc.o ckdevelop.moc.o kdevelop_meta_unload.o  ./vc/libvc.a 
./print/libprint.a ./kwrite/libkwrite.a ./gfxview/libgfxview.a ./dbg/libdbg.a 
./classwizard/libclasswizard.a ./kpp/libkpp.a ./classparser/libclassparser.a 
-lkhtml -lm -lkfile -lkdeui -lkdecore -lqt -lpng -lz -lm -ljpeg -lXext -lX11  
-lSM -lICE
g++ -O2 -fno-exceptions -fno-check-new -Wall -pedantic -W -Wpointer-arith 
-Wmissing-prototypes -Wwrite-strings -Wno-long-long -Wnon-virtual-dtor 
-fno-builtin -o kdevelop cerrormessageparser.o ckdevelop.o 
ckdevelop_classview.o ckdevelop_noslot.o cprjoptionsdlg.o ckappwizard.o 
ckdevelop_init.o main.o ktipofday.o kstartuplogo.o klangcombo.o 
kdevlistview.o grepdialog.o doctreeview.o dbgtoolbar.o dbgpsdlg.o 
cupdatekdedocdlg.o ctreeview.o ctreehandler.o ctoolsconfigdlg.o ctoolclass.o 
ctabctl.o crealfileview.o cproject.o coutputwidget.o cnewfiledlg.o 
cnewclassdlg.o cmakemanualdlgdata.o cmakemanualdlg.o clogfileview.o 
ckdevsetupdlg.o ckdevinstall.o ckdevelop_whatsthis.o ckdevelop_project.o 
cclasstreehandler.o ckdevaccel.o cgrouppropertiesdlg.o cgeneratenewfile.o 
cfinddoctextdlg.o cfilepropdlg.o cexecuteargdlg.o ceditwidget.o 
cdoctreepropdlg.o cdocbrowser.o ccvaddfolderdlg.o ccreatedocdatabasedlg.o 
cclonefunctiondlg.o cclassview.o wzconnectdlgimpl.o cclasstooltreeview.o 
cclasstooldlg.o caddnewtranslationdlg.o caddexistingfiledlg.o 
caddclassmethoddlg.o caddclassattributedlg.o wzconnectdlg.o ktipofdaydlg.o 
wzconnectdlgimpl.moc.o ckdevelop.moc.o kdevelop_meta_unload.o  
-L/usr/X11R6/lib -L/usr/lib/qt2/lib -L/opt/kde2/lib ./vc/libvc.a 
./print/libprint.a ./kwrite/libkwrite.a ./gfxview/libgfxview.a ./dbg/libdbg.a 
./classwizard/libclasswizard.a ./kpp/libkpp.a ./classparser/libclassparser.a 
/opt/kde2/lib/libkhtml.so -L/usr/lib/gcc-lib/i586-pc-linux-gnu/2.95.3 
-L/usr/i586-pc-linux-gnu/lib /opt/kde2/lib/libkjava.so 
/opt/kde2/lib/libkdeprint.so /opt/kde2/lib/libkparts.so -lm -lm 
/opt/kde2/lib/libkfile.so /opt/kde2/lib/libksycoca.so /opt/kde2/lib/libkio.so 
/opt/kde2/lib/libkdesu.so -lutil /opt/kde2/lib/libkssl.so -lm 
/opt/kde2/lib/libkdeui.so -lm /opt/kde2/lib/libkdecore.so -ldl 
/opt/kde2/lib/libDCOP.so -lstdc++ -lm -lc -lgcc
-lqt -lpng -lz -lm /usr/lib/libjpeg.so -lXext -lX11 -lSM -lICE -Wl,--rpath 
-Wl,/opt/kde2/lib -Wl,--rpath -Wl,/opt/kde2/lib -Wl,--rpath 
-Wl,/usr/lib/qt2/lib -Wl,--rpath -Wl,/usr/X11R6/lib
./classparser/libclassparser.a(tokenizer.o): In function 
`yyFlexLexer::yylex(void)':
tokenizer.o(.text+0x668): undefined reference to `yywrap'
./classparser/libclassparser.a(tokenizer.o): In function 
`yyFlexLexer::yyinput(void)':
tokenizer.o(.text+0xd0b): undefined reference to `yywrap'
collect2: ld returned 1 exit status
make[3]: *** [kdevelop] Error 1
make[3]: Leaving directory `/opt/kde2/progs/kdevelop/kdevelop'
make[2]: *** [all-recursive] Error 1
make[2]: Leaving directory `/opt/kde2/progs/kdevelop/kdevelop'
make[1]: *** [all-recursive] Error 1
make[1]: Leaving directory `/opt/kde2/progs/kdevelop'
make: *** [all-recursive-am] Error 2
root at b4-413-d122:/opt/kde2/progs/kdevelop >

So, the same code which compiled yesterday did not compile today. Howto solve 
this ? Please help! I can only work with kde1-Kdevelop-1.3 which is quite 
anoying.

Bye

  Thorsten 

-
to unsubscribe from this list send an email to kdevelop-request at kdevelop.org with the following body:
unsubscribe »your-email-address«



More information about the KDevelop mailing list