KDevelop doesn't work

Markus Jetzer markus.linux at freenet.de
Sat Dec 29 00:41:41 GMT 2001

Dear Programmers

Well, I'm new here
My name is Markus
I'm from Switzerland 
I live near Basel in the north of Switzerland

I don't have a lot of Linux expirience.
And I need your help.

Linux SuSe 7.3
KDE 2.2.1
KDevelop 2.0.2

My worst Problem is the KDevelop.
I can't produce a project. Therefore I made an update (2.0.2-2).
Now it works.
But I have problems when I want to ""Erstellen"" the programm.
The following message appears:

gmake[2]: Leaving directory `/home/markus1/Test/nachu3/nachu3'
gmake[2]: *** [nachu3] Error 1
gmake[1]: Leaving directory `/home/markus1/Test/nachu3'
gmake[1]: *** [all-recursive] Error 1
gmake: *** [all-recursive-am] Error 2
*** fehlgeschlagen ***

I don't know what I have to do.
Please help me.

Kind regards

Happy 2002!!!

to unsubscribe from this list send an email to kdevelop-request at kdevelop.org with the following body:
unsubscribe »your-email-address«

More information about the KDevelop mailing list