Problems when compiling latest snashots for KDE 1.1.x

Pascal Francq pfrancq at
Fri Aug 4 15:00:51 BST 2000

I try to compile the latest snashofts of KDevelop for KDE 1.1.x. I have these
error messages:

libtool: link: warning: `-version-info' is ignored for programs
g++ -O2 -fno-exceptions -fno-rtti -fno-check-new -frtti -s -o .libs/ libkdlgloader_la_closure.o -s kdlgldr.o kdlgldr_itemstuff.o kdlgptrdb.o -L/usr/X11R6/lib -L/opt/kde/lib /opt/kde/lib/ /opt/kde/lib/ -lXext -lqt -lpng -lz -lm -lXext -lX11 -lXext -lqt -lpng -lz -lm -lXext -lX11  -Wl,--rpath -Wl,/opt/kde/lib
/bin/sh ../libtool --mode=link g++  -O2 -fno-exceptions -fno-rtti -fno-check-new -frtti  -s -o -rpath /opt/kde/lib -L/usr/X11R6//lib -L/opt/kde/lib  -no-undefined -version-info 1:0 -s kdlgldr.lo kdlgldr_itemstuff.lo kdlgptrdb.lo -lkdeui -lkdecore -lXext -lqt -lpng -lz -lm -lXext -lX11   -lXext  -lqt -lpng -lz -lm -lXext -lX11
rm -fr .libs/ .libs/libkdlgloader.* .libs/libkdlgloader.*
g++ -shared  kdlgldr.lo kdlgldr_itemstuff.lo kdlgptrdb.lo  -L/usr/X11R6/lib -L/opt/kde/lib /opt/kde/lib/ /opt/kde/lib/ -lXext -lqt -lpng -lz -lm -lXext -lX11 -lXext -lqt -lpng -lz -lm -lXext -lX11 -lc  -Wl,-soname -Wl, -o .libs/
/usr/bin/ld: .libs/ undefined versioned symbol name clog@@GLIBC_2.1
/usr/bin/ld: failed to set dynamic section sizes: Bad value
collect2: ld returned 1 exit status
make[2]: *** [] Error 1
make[2]: Leaving directory `/usr/src/sources/DevTools/kdevelop/kdlgloader'
make[1]: *** [all-recursive] Error 1
make[1]: Leaving directory `/usr/src/sources/DevTools/kdevelop'
make: *** [all-recursive-am] Error 2    

But, I can compile the snapshots of june and I have glibc-2.1.2-3  installed
(Caldera OpenLinux 2.4). So, what is going wrong?

Ir. Pascal Francq
Université Libre de Bruxelles
Faculty of Applied Mechanics
Avenue F.D. Roosevelt, 50
CP 165/41
B-1050 Brussels
Tel. +32-2-650 47 65
Fax +32-2-650 27 10

More information about the KDevelop mailing list