CVS compile fail ...

alex.saal at alex.saal at
Sat Mar 5 17:54:05 UTC 2005

hi guys,

the cvs compile is fail:
autoprojectviewbase.cpp: In constructor `
   AutoProjectViewBase::AutoProjectViewBase(QWidget*, const char*, unsigned
autoprojectviewbase.cpp:61: error: `setShadeSortColumn' undeclared (first use
   this function)
autoprojectviewbase.cpp:61: error: (Each undeclared identifier is reported 
   once for each function it appears in.)
make[3]: *** [autoprojectviewbase.lo] Fehler 1
make[3]: Leaving directory `/home/alex/cvs/kdevelop/buildtools/autotools'
make[2]: *** [all-recursive] Fehler 1
make[2]: Leaving directory `/home/alex/cvs/kdevelop/buildtools'
make[1]: *** [all-recursive] Fehler 1
make[1]: Leaving directory `/home/alex/cvs/kdevelop'
make: *** [all] Fehler 2

Alexander Saal

More information about the KDevelop-devel mailing list