Make errors with latest CVS.

Richard A Downing richard.downing at
Sun Dec 29 15:46:02 UTC 2002

My make of a clean cvs today is failing as follows.
The alpha release compiled fine.

I have libart installed and /usr/lib/ exists.  Is there a way I can find out which sysmbols it contains?
I don't know how to debug this, so any pointers would be appreciated.

/opt/kde-3.1-rc5/lib/kde3/plugins/designer/ Feature KURLLabel already defined in /opt/kde/lib/kde3/plugins/designer/!
/opt/kde-3.1-rc5/lib/kde3/plugins/designer/ Feature KURLRequester already defined in /opt/kde/lib/kde3/plugins/designer/!
/opt/qt/bin/uic: relocation error: /usr/lib/ symbol __cxa_finalize, version IBC_2.1.3 not defined in file with link time reference
make[4]: *** [doctreeprojectconfigwidgetbase.cpp] Error 127
make[4]: Leaving directory `/home/richard/Projects/kdevelop/parts/doctreeview'
make[3]: *** [all-recursive] Error 1
make[3]: Leaving directory `/home/richard/Projects/kdevelop/parts/doctreeview'
make[2]: *** [all-recursive] Error 1
make[2]: Leaving directory `/home/richard/Projects/kdevelop/parts'
make[1]: *** [all-recursive] Error 1
make[1]: Leaving directory `/home/richard/Projects/kdevelop'
make: *** [all] Error 2

Cheers, Richard.
Richard A Downing FBCS

More information about the KDevelop-devel mailing list