keduca error

Barney Erasmus tertulian at
Sun Sep 15 08:49:16 BST 2002

I wonder if any one could help.

I'm trying to compile keduca 0.4.0 on Red hat 7.3 with Kde 3.01. I
configured the make file using kdevelop 2.1. Kdevelop tells me that the
configure was successful. But when I try to compile it it comes up with the
following errors:

-virtual-dtor -fno-builtin -O0 -g3 -Wall -c klangcombo.cpp
In file included from klangcombo.h:28,
from klangcombo.cpp:29:
ktagcombobox.h:87: syntax error before `*'
ktagcombobox.cpp: In method `void KTagComboBox::paintEvent (QPaintEvent
ktagcombobox.cpp:177: invalid use of undefined type `class QStyle'
/usr/lib/qt3-gcc2.96/include/qwidget.h:58: forward declaration of `class
make[3]: *** [klangcombo.o] Error 1
make[3]: *** Waiting for unfinished jobs....
make[3]: Leaving directory `/usr/src/keduca/keduca'
make[3]: *** [ktagcombobox.o] Error 1
make[2]: Leaving directory `/usr/src/keduca/keduca'
make[2]: *** [all-recursive] Error 1
make[1]: Leaving directory `/usr/src/keduca'
make[1]: *** [all-recursive] Error 1
make: *** [all-recursive-am] Error 2
*** failed ***



This message is from the kde mailing list.
Account management:
More info:

More information about the kde mailing list