[kde-solaris] Compile problem

Mats Rojestal mats.rojestal at bredband.net
Fri Oct 22 01:31:40 CEST 2004


I am trying to compile kdemultimedia from cvs and i get the following error.

Undefined			first referenced
  symbol  			    in file
virtual thunk to Arts::StdSynthModule::streamInit()./.libs/libartsmidi.so
virtual thunk to Arts::StdSynthModule::autoSuspend()./.libs/libartsmidi.so
virtual thunk to Arts::StdSynthModule::streamStart()./.libs/libartsmidi.so
virtual thunk to Arts::StdSynthModule::streamEnd()./.libs/libartsmidi.so
virtual thunk to Arts::StdSynthModule::start()./.libs/libartsmidi.so
virtual thunk to Arts::StdSynthModule::stop()./.libs/libartsmidi.so
ld: fatal: Symbol referencing errors. No output written to 
collect2: ld returned 1 exit status
gmake[4]: *** [midisynctest] Error 1
gmake[4]: Leaving directory `/usr/local/src/kde/kdemultimedia/arts/midi'
gmake[3]: *** [all-recursive] Error 1
gmake[3]: Leaving directory `/usr/local/src/kde/kdemultimedia/arts/midi'
gmake[2]: *** [all-recursive] Error 1
gmake[2]: Leaving directory `/usr/local/src/kde/kdemultimedia/arts'
gmake[1]: *** [all-recursive] Error 1
gmake[1]: Leaving directory `/usr/local/src/kde/kdemultimedia'
gmake: *** [all] Error 2

gcc is 3.4.2 platform is solaris9 x86


	Mats R

More information about the kde-solaris mailing list