[kde-solaris] kde 3.2.0 kdebase compile problem

LeBar, Russell J Russell.J.LeBar at erac.com
Mon Feb 16 23:18:44 CET 2004

Getting the following error when trying to 'make' kdebase. Using Qt 3.3.0, gcc 3.2.1, gnu ld and asm, etc.  Only configure options are turning debug off and specifying where to install it (relying on the environment for the rest). I was wondering if anyone else had encountered it and if they had a workaround?

gmake[3]: Entering directory `/export/home/rjl01/4laptop/kde320/kdebase-3.2.0/kate/app'
/bin/bash ../../libtool --silent --mode=link --tag=CXX g++  -Wnon-virtual-dtor -Wno-long-long -Wundef -Wall -W -Wpointer-arith -Wwrite-strings -DNDEBUG -DNO_DEBUG -O2 -fno-exceptions -fno-check-new -fno-common -DQT_CLEAN_NAMESPACE -DQT_NO_ASCII_CAST -DQT_NO_STL -DQT_NO_COMPAT -DQT_NO_TRANSLATION -D_GNU_SOURCE    -o kwrite -R /usr/local/kde320/lib -R /usr/local/qt-x11-free-3.3.0/lib -no-undefined -L/usr/local/qt-x11-free-3.3.0/lib -L/usr/local/kde320/lib  kwrite.la.o libkdeinit_kwrite.la
./.libs/libkdeinit_kwrite.so: undefined reference to `QTextStream::QTextStream[not-in-charge](__FILE*, int)'
collect2: ld returned 1 exit status
gmake[3]: *** [kwrite] Error 1
gmake[3]: Leaving directory `/export/home/rjl01/4laptop/kde320/kdebase-3.2.0/kate/app'
gmake[2]: *** [all-recursive] Error 1
gmake[2]: Leaving directory `/export/home/rjl01/4laptop/kde320/kdebase-3.2.0/kate'
gmake[1]: *** [all-recursive] Error 1
gmake[1]: Leaving directory `/export/home/rjl01/4laptop/kde320/kdebase-3.2.0'
gmake: *** [all] Error 2

Russ LeBar	
UNIX System Administrator

More information about the kde-solaris mailing list