[kde-solaris] Compiling arts-1.2.2 (kde 3.1.2)

Basavaraj Karadakal kvbraj at yahoo.com
Sat Jun 14 07:44:22 CEST 2003

   I am trying to compile arts-1.2.2 for solaris 2.7.
When I ran configure I got warning that the audio
server could not be found on my system. I thought it's
safe to proceed and started the compilation. I am
using gcc 2.9.5. I get following error 

libtool: link: warning: `-version-info' is ignored for
/bin/ksh ../libtool --silent --mode=link --tag=CXX g++
 -Wnon-virtual-dtor -Wno-long-long -Wundef -Wall
-pedantic -W -Wpointer-arith -Wmissing-prototypes
-Wwrite-strings -O2 -fno-exceptions -fno-check-new 
-ftemplate-depth-99    -o libmcop.la -rpath
/home/users/tools/kde/lib -no-undefined -version-info
1:0 buffer.lo connection.lo core.lo dispatcher.lo
iomanager.lo object.lo socketconnection.lo
tcpconnection.lo unixconnection.lo tcpserver.lo
unixserver.lo objectmanager.lo factory.lo
idlfilereg.lo ifacerepo_impl.lo mcoputils.lo
startupmanager.lo md5.lo md5auth.lo referenceclean.lo
datapacket.lo asyncstream.lo notification.lo
flowsystem.lo extensionloader.lo tmpglobalcomm.lo
mcopconfig.lo connect.lo reference.lo type.lo
trader_impl.lo dynamicrequest.lo anyref.lo loopback.lo
debug.lo delayedreturn.lo thread.lo dynamicskeleton.lo
-lsocket  -lnsl ../libltdl/libltdlc.la 
.libs/libmcop.so.1.0.0: undefined versioned symbol
name __deregister_frame@@GCC_3.0
/usr/local/sparc-sun-solaris2.7/bin/ld: failed to set
dynamic section sizes: Bad value
collect2: ld returned 1 exit status
gmake[2]: *** [libmcop.la] Error 1
gmake[2]: Leaving directory
gmake[1]: *** [all-recursive] Error 1
gmake[1]: Leaving directory
gmake: *** [all] Error 2

can some one help me?


Do you Yahoo!?
SBC Yahoo! DSL - Now only $29.95 per month!

More information about the kde-solaris mailing list