[kde-edu]: Can't compile kdeedu because of kalzium solver

Anne-Marie Mahfouf annemarie.mahfouf at free.fr
Tue Nov 1 19:38:17 CET 2005

On Tuesday 01 November 2005 13:51, Jure Repinc wrote:
> Making all in solver
> /bin/sh: line 0: cd: solver: No such file or directory
> make[3]: *** [all-recursive] Error 1
> make[3]: Leaving directory `/home/kdedev/src/kde/build/kdeedu/kalzium/src'
> make[2]: *** [all-recursive] Error 1
> make[2]: Leaving directory `/home/kdedev/src/kde/build/kdeedu/kalzium'
> make[1]: *** [all-recursive] Error 1
> make[1]: Leaving directory `/home/kdedev/src/kde/build/kdeedu'
> make: *** [all] Error 2

do you have the solver/ subdir in src?
the error suggests that it is not there...

it builds fine here, I made distclean and rebuilt it all to check.


More information about the kde-edu mailing list