[Digikam-users] error making digikam-libs 0.9.5 from svn

Caspar Maessen cmaessen at casco.demon.nl
Thu Mar 19 22:09:56 GMT 2009

Compiling digikam-libs 0.9.5 from svn gives me the following error on 
executing make:

mv -f .deps/libraw_la-libraw_c_api.Tpo .deps/libraw_la-libraw_c_api.Plo
/bin/sh ../../libtool --silent --tag=CXX   --mode=compile 
g++ -DHAVE_CONFIG_H -I. -I../.. -I/opt/kde3/include -I/usr/lib/qt3/include -I.   -DQT_THREAD_SUPPORT  -D_REENTRANT -w -Wno-long-long -Wundef -ansi -D_XOPEN_SOURCE=500 -D_BSD_SOURCE -Wcast-align -Wchar-subscripts -Wall -W -Wpointer-arith -fno-builtin -g3 -fno-inline -Wformat-security -Wmissing-format-attribute -Wno-non-virtual-dtor -fno-exceptions -fno-check-new -fno-common -DQT_CLEAN_NAMESPACE -DQT_NO_ASCII_CAST -DQT_NO_STL -DQT_NO_COMPAT -DQT_NO_TRANSLATION -fopenmp -fexceptions -DDCRAW_VERBOSE -DUSE_LCMS -MT 
libraw_la-dcraw_common.lo -MD -MP -MF .deps/libraw_la-dcraw_common.Tpo -c -o 
libraw_la-dcraw_common.lo `test -f 'internal/dcraw_common.cpp' || 
echo './'`internal/dcraw_common.cpp
dcraw/dcraw.c: In member function 'void LibRaw::wavelet_denoise()':
dcraw/dcraw.c:4421: error: expected '#pragma omp' clause before '*' token
make[3]: *** [libraw_la-dcraw_common.lo] Fout 1
make[3]: Map '/home/builds/digikam-svn/libs/libkdcraw/libraw' wordt verlaten
make[2]: *** [all-recursive] Fout 1
make[2]: Map '/home/builds/digikam-svn/libs/libkdcraw' wordt verlaten
make[1]: *** [all-recursive] Fout 1
make[1]: Map '/home/builds/digikam-svn/libs' wordt verlaten
make: *** [all] Fout 2


More information about the Digikam-users mailing list