[Digikam-users] digikam-0.9.2: make fails

Stefan K├Âlling StefanKoelling at web.de
Sat Jun 23 17:12:55 BST 2007


Compiling digikam-0.9.2 leads to this error:

Making all in hotpixels
make[4]: Entering directory 
`/usr/src/packages/BUILD/digikam-0.9.2/digikam/imageplugins/hotpixels'
/usr/lib/qt3/bin/moc ./blackframeparser.h -o blackframeparser.moc
/usr/lib/qt3/bin/moc ./blackframelistview.h -o blackframelistview.moc
/usr/lib/qt3/bin/moc ./imageplugin_hotpixels.h -o imageplugin_hotpixels.moc
/usr/lib/qt3/bin/moc ./imageeffect_hotpixels.h -o imageeffect_hotpixels.moc
creating digikamimageplugin_hotpixels_la.all_cpp.cpp ...
if /bin/sh ../../../libtool --silent --tag=CXX --mode=compile g++ 
-DHAVE_CONFIG_H -I. -I. -I../../.. 
-I../../../digikam/utilities/imageeditor/editor 
-I../../../digikam/utilities/imageeditor/canvas 
-I../../../digikam/libs/histogram -I../../../digikam/libs/levels 
-I../../../digikam/libs/curves -I../../../digikam/libs/whitebalance 
-I../../../digikam/libs/widgets/common 
-I../../../digikam/libs/widgets/iccprofiles 
-I../../../digikam/libs/widgets/imageplugins 
-I../../../digikam/libs/dialogs -I../../../digikam/libs/dimg 
-I../../../digikam/libs/dmetadata -I../../../digikam/libs/dimg/filters 
-I../../../digikam/digikam -I/opt/kde3/include -I/usr/lib/qt3/include 
-I/usr/X11R6/include    -DQT_THREAD_SUPPORT  -D_REENTRANT 
-Wno-long-long -Wundef -ansi -D_XOPEN_SOURCE=500 -D_BSD_SOURCE 
-Wcast-align -Wchar-subscripts -Wall -W -Wpointer-arith -DNDEBUG 
-DNO_DEBUG -O2 -O2 -g -march=i686 -mcpu=i686 -Wformat-security 
-Wmissing-format-attribute -Wno-non-virtual-dtor -fno-exceptions 
-fno-check-new -fno-common -DQT_CLEAN_NAMESPACE -DQT_NO_ASCII_CAST 
-DQT_NO_STL -DQT_NO_COMPAT -DQT_NO_TRANSLATION -DQT_CLEAN_NAMESPACE  -MT 
digikamimageplugin_hotpixels_la.all_cpp.lo -MD -MP -MF 
".deps/digikamimageplugin_hotpixels_la.all_cpp.Tpo" -c -o 
digikamimageplugin_hotpixels_la.all_cpp.lo 
digikamimageplugin_hotpixels_la.all_cpp.cpp; \
then mv -f ".deps/digikamimageplugin_hotpixels_la.all_cpp.Tpo" 
".deps/digikamimageplugin_hotpixels_la.all_cpp.Plo"; else rm -f 
".deps/digikamimageplugin_hotpixels_la.all_cpp.Tpo"; exit 1; fi
In file included from digikamimageplugin_hotpixels_la.all_cpp.cpp:7:
imageeffect_hotpixels.cpp: In member function `void
 
DigikamHotPixelsImagesPlugin::ImageEffect_HotPixels::slotAddBlackFrame()':
imageeffect_hotpixels.cpp:161: error: type specifier omitted for parameter `
    KImageIO::pattern()'
imageeffect_hotpixels.cpp:161: error: type specifier omitted for parameter
imageeffect_hotpixels.cpp:161: error: syntax error before `this'
imageeffect_hotpixels.cpp:162: error: request for member `setCaption' in `
    DigikamHotPixelsImagesPlugin::fileSelectDialog', which is of 
non-aggregate
    type `KFileDialog ()(...)'
imageeffect_hotpixels.cpp:163: confused by earlier errors, bailing out
make[4]: *** [digikamimageplugin_hotpixels_la.all_cpp.lo] Fehler 1
make[4]: Leaving directory 
`/usr/src/packages/BUILD/digikam-0.9.2/digikam/imageplugins/hotpixels'
make[3]: *** [all-recursive] Fehler 1
make[3]: Leaving directory 
`/usr/src/packages/BUILD/digikam-0.9.2/digikam/imageplugins'
make[2]: *** [all-recursive] Fehler 1
make[2]: Leaving directory `/usr/src/packages/BUILD/digikam-0.9.2/digikam'
make[1]: *** [all-recursive] Fehler 1
make[1]: Leaving directory `/usr/src/packages/BUILD/digikam-0.9.2'
make: *** [all] Fehler 2
error: Bad exit status from /var/tmp/rpm-tmp.68036 (%build)

Configure shows no errors:

-- digiKam configure results -------------------
-- libsqlite3 library found....... YES
-- libgphoto2 library found....... YES
-- libkipi library found.......... YES
-- libtiff library found..... .... YES
-- libpng library found........... YES
-- libjasper library found........ YES
-- liblcms library found.......... YES
-- libkexiv2 library found........ YES
-- libkdcraw library found........ YES
------------------------------------------------

Good - your configure finished. Start make now


Thank you very much for your advice.

Regards,
Stefan



More information about the Digikam-users mailing list