[Digikam-devel] [Bug 195735] digikam-svn fails to compile on Mac OS X

rishi.j.sanyal at gmail.com rishi.j.sanyal at gmail.com
Tue Jun 9 22:00:03 BST 2009


--- Comment #6 from  <rishi j sanyal gmail com>  2009-06-09 23:00:01 ---
Also, Gilles, interestingly enough, before pgfloader was failing as described
in this bug, I was getting the same exact error with qtpgftest:

[  0%] Building CXX object
In function ‘UINT64 ByteSwap(UINT64)’:
error: ‘_byteswap_uint64’ was not declared in this scope
make[2]: *** [digikam/libs/database/test/CMakeFiles/qtpgftest.dir/qtpgftest.o]
Error 1
make[1]: *** [digikam/libs/database/test/CMakeFiles/qtpgftest.dir/all] Error 2
make: *** [all] Error 2

However, a SVN update a week ago or so got rid of that problem, at which time I
started getting the pgfloader problem.

Anyway, looks like this particular problem is now fixed, but I thought I'd
bring it to your attention anyway in case it reminds you of anywhere else this
problem might resurface.


Configure bugmail: https://bugs.kde.org/userprefs.cgi?tab=email
------- You are receiving this mail because: -------
You are the assignee for the bug.

More information about the Digikam-devel mailing list