compile failing

Derek Tombrello RebelTaz at
Thu May 14 02:29:48 BST 2020

Thank you. That got me past that, but then it failed at:

> In file included from 
> /home/derek/Downloads/tellico-3.3/src/gui/imagewidget.cpp:27:0:
> /home/derek/Downloads/tellico-3.3/src/gui/../images/image.h:62:3: 
> error: ‘qsizetype’ does not name a type; did you mean ‘iswctype’?
>    qsizetype byteSize() const;
>    ^~~~~~~~~
>    iswctype
> src/gui/CMakeFiles/gui.dir/build.make:326: recipe for target 
> 'src/gui/CMakeFiles/gui.dir/imagewidget.cpp.o' failed
> make[2]: *** [src/gui/CMakeFiles/gui.dir/imagewidget.cpp.o] Error 1
> CMakeFiles/Makefile2:991: recipe for target 
> 'src/gui/CMakeFiles/gui.dir/all' failed
> make[1]: *** [src/gui/CMakeFiles/gui.dir/all] Error 2
> Makefile:140: recipe for target 'all' failed
> make: *** [all] Error 2

✞ Derek Tombrello (KM4JAG)

/"First they came for the Communists, but I was not a Communist so I did 
not speak out.
Then they came for the Socialists and the Trade Unionists, but I was 
neither, so I did not speak out.
Then they came for the Jews, but I was not a Jew so I did not speak out.
And when they came for me, there was no one left to speak out for me."

On 5/13/20 8:18 PM, Robby Stephenson wrote:
> On Wed, May 13, 2020 at 9:12 PM Derek Tombrello 
> <RebelTaz at 
> <mailto:RebelTaz at>> wrote:
>     I previously compiled v3.2.3 on this laptop, so the depoendancies
>     should still be met, but I kept running into errors. I figured out
>     that it was looking for and installed:
> I had an oopsie that inadvertently required Qt 5.14. There's a simple 
> patch
> Robby
-------------- next part --------------
An HTML attachment was scrubbed...
URL: <>

More information about the tellico-users mailing list