[rkward-devel] Having trouble building; cmake/modules/FindKDE4Internal.cmake not found

Germán Márquez Mejía manchito at gmail.com
Fri Oct 2 05:56:31 UTC 2009


El Vie 02 Oct 2009 00:24:44 Michael Ash escribió:
> OK. I needed to install kdelibs5-dev (I had kdelibs4-dev installed)
> Now I am having another trouble. The build goes along for a while and
> then has this problem:

> /home/mash/Desktop/rkward_trunk/rkward/rkward/scriptbackends/qtscriptbacken
>d.cpp:226: undefined reference to `QScriptValue::~QScriptValue()'
> collect2: ld returned 1 exit status
> make[2]: *** [rkward/rkward.bin] Error 1
> make[1]: *** [rkward/CMakeFiles/rkward.bin.dir/all] Error 2
> make: *** [all] Error 2

I'm not very familiar with (K)Ubuntu, but perhaps you should install libqt4-
dev package an make sure that you are building upon the latest svn rev.

Hope it works!


More information about the Rkward-devel mailing list