Build failed in Jenkins: plasma-workspace_master_qt5 #979

KDE CI System null at kde.org
Wed Oct 15 18:37:17 UTC 2014


See <http://build.kde.org/job/plasma-workspace_master_qt5/979/changes>

Changes:

[aleixpol] Actively enforce that the panel is smaller than the screen.

------------------------------------------
[...truncated 2324 lines...]
<command-line>:0:0: warning: "TRANSLATION_DOMAIN" redefined [enabled by default]
<command-line>:0:0: note: this is the location of the previous definition
Linking CXX executable keyboardGrabber
Linking CXX executable authenticatorTest
[ 38%] Built target authenticatorTest
[ 38%] Building CXX object ksmserver/screenlocker/kcm/CMakeFiles/screenlocker_kcm.dir/screenlocker_kcm_automoc.cpp.o
[ 38%] Scanning dependencies of target lockWindowTest
Built target keyboardGrabber
<command-line>:0:0: warning: "TRANSLATION_DOMAIN" redefined [enabled by default]
<command-line>:0:0: note: this is the location of the previous definition
[ 38%] Building CXX object ksmserver/screenlocker/autotests/CMakeFiles/lockWindowTest.dir/lockwindowtest.cpp.o
[ 38%] Building CXX object ksmserver/screenlocker/CMakeFiles/screenlocker_static.dir/logind.cpp.o
[ 39%] Building CXX object ksmserver/screenlocker/greeter/CMakeFiles/kscreenlocker_greet.dir/qrc_fallbacktheme.cpp.o
[ 39%] Building CXX object ksmserver/screenlocker/autotests/CMakeFiles/lockWindowTest.dir/__/lockwindow.cpp.o
[ 39%] Building CXX object klipper/CMakeFiles/plasma_engine_clipboard.dir/plasma_engine_clipboard_automoc.cpp.o
Linking CXX executable testsh
[ 39%] Building CXX object ksmserver/screenlocker/greeter/CMakeFiles/kscreenlocker_greet.dir/kscreensaversettings.cpp.o
[ 39%] [ 39%] Building CXX object ksmserver/screenlocker/greeter/CMakeFiles/kscreenlocker_greet.dir/kscreenlocker_greet_automoc.cpp.o
Building CXX object ksmserver/screenlocker/CMakeFiles/screenlocker_static.dir/screensaveradaptor.cpp.o
[ 40%] Building CXX object ksmserver/screenlocker/autotests/CMakeFiles/lockWindowTest.dir/lockWindowTest_automoc.cpp.o
Linking CXX shared module screenlocker_kcm.so
[ 40%] Built target testsh
Scanning dependencies of target logindTest
[ 40%] Building CXX object ksmserver/screenlocker/autotests/CMakeFiles/logindTest.dir/logindtest.cpp.o
[ 40%] Built target screenlocker_kcm
Scanning dependencies of target pointerGrabber
[ 40%] Building CXX object ksmserver/screenlocker/autotests/CMakeFiles/pointerGrabber.dir/pointergrabber.cpp.o
Scanning dependencies of target ksplashqml
[ 40%] Building CXX object ksmserver/screenlocker/CMakeFiles/screenlocker_static.dir/kscreensaveradaptor.cpp.o
[ 40%] Building CXX object ksplash/ksplashqml/CMakeFiles/ksplashqml.dir/main.cpp.o
[ 40%] Building CXX object ksmserver/screenlocker/autotests/CMakeFiles/logindTest.dir/fakelogind.cpp.o
Linking CXX executable lockWindowTest
Linking CXX shared module plasma_engine_clipboard.so
[ 40%] Building CXX object ksmserver/screenlocker/autotests/CMakeFiles/pointerGrabber.dir/pointerGrabber_automoc.cpp.o
[ 40%] Built target lockWindowTest
[ 40%] Building CXX object ksmserver/screenlocker/autotests/CMakeFiles/logindTest.dir/__/logind.cpp.o
Linking CXX executable pointerGrabber
[ 40%] Building CXX object ksmserver/screenlocker/autotests/CMakeFiles/logindTest.dir/logindTest_automoc.cpp.o
[ 40%] Linking CXX executable kscreenlocker_greet
Built target pointerGrabber
[ 41%] Built target plasma_engine_clipboard
Scanning dependencies of target kded_ksysguard
Scanning dependencies of target systemmonitor
[ 42%] [ 42%] Building CXX object systemmonitor/CMakeFiles/systemmonitor.dir/ksystemactivitydialog.cpp.o
Building CXX object systemmonitor/CMakeFiles/kded_ksysguard.dir/kdedksysguard.cpp.o
[ 42%] Building CXX object systemmonitor/CMakeFiles/systemmonitor.dir/main.cpp.o
[ 42%] Built target kscreenlocker_greet
[ 42%] [ 42%] Generating statusnotifieritem_interface.cpp, statusnotifieritem_interface.h
Building CXX object ksplash/ksplashqml/CMakeFiles/ksplashqml.dir/SplashApp.cpp.o
[ 42%] Generating statusnotifierwatcheradaptor.cpp, statusnotifierwatcheradaptor.h
[ 42%] [ 42%] Generating statusnotifierwatcheradaptor.moc
Building CXX object ksmserver/screenlocker/CMakeFiles/screenlocker_static.dir/kscreensaversettings.cpp.o
[ 42%] Generating statusnotifieritem_interface.moc
[ 42%] Building CXX object ksmserver/screenlocker/CMakeFiles/screenlocker_static.dir/ksmserver_interface.cpp.o
Scanning dependencies of target kded_statusnotifierwatcher
[ 42%] Building CXX object ksmserver/screenlocker/CMakeFiles/screenlocker_static.dir/powerdevilpolicyagent.cpp.o
[ 42%] Building CXX object statusnotifierwatcher/CMakeFiles/kded_statusnotifierwatcher.dir/statusnotifierwatcher.cpp.o
Linking CXX executable logindTest
<http://build.kde.org/job/plasma-workspace_master_qt5/ws/systemmonitor/kdedksysguard.cpp>:39:1: warning: unused parameter ‘parent’ [-Wunused-parameter]
 KDEDKSysGuard::KDEDKSysGuard(QObject* parent, const QVariantList&)
 ^
[ 42%] [ 43%] Building CXX object systemmonitor/CMakeFiles/systemmonitor.dir/systemmonitor_automoc.cpp.o
Building CXX object statusnotifierwatcher/CMakeFiles/kded_statusnotifierwatcher.dir/statusnotifierwatcheradaptor.cpp.o
[ 43%] Linking CXX executable systemmonitor
Built target logindTest
[ 43%] Building CXX object statusnotifierwatcher/CMakeFiles/kded_statusnotifierwatcher.dir/statusnotifieritem_interface.cpp.o
[ 43%] [ 43%] Building CXX object systemmonitor/CMakeFiles/kded_ksysguard.dir/kded_ksysguard_automoc.cpp.o
Building CXX object statusnotifierwatcher/CMakeFiles/kded_statusnotifierwatcher.dir/kded_statusnotifierwatcher_automoc.cpp.o
[ 43%] Building CXX object ksplash/ksplashqml/CMakeFiles/ksplashqml.dir/SplashWindow.cpp.o
[ 44%] Building CXX object ksmserver/screenlocker/CMakeFiles/screenlocker_static.dir/screenlocker_static_automoc.cpp.o
[ 44%] Generating klauncher_iface.cpp, klauncher_iface.h
[ 44%] Generating klauncher_iface.moc
[ 44%] Built target systemmonitor
[ 44%] Building CXX object ksplash/ksplashqml/CMakeFiles/ksplashqml.dir/ksplashqml_automoc.cpp.o
Scanning dependencies of target kdeinit_kcminit
[ 44%] Building CXX object startkde/kcminit/CMakeFiles/kdeinit_kcminit.dir/main.cpp.o
[ 44%] Building CXX object startkde/kcminit/CMakeFiles/kdeinit_kcminit.dir/klauncher_iface.cpp.o
[ 44%] Building CXX object startkde/kcminit/CMakeFiles/kdeinit_kcminit.dir/kdeinit_kcminit_automoc.cpp.o
Linking CXX shared module kded_ksysguard.so
[ 44%] Built target kded_ksysguard
Scanning dependencies of target kdeinit_kcminit_startup
Scanning dependencies of target kdostartupconfig5
[ 44%] Building CXX object startkde/kcminit/CMakeFiles/kdeinit_kcminit_startup.dir/main.cpp.o
[ 44%] Building CXX object startkde/kstartupconfig/CMakeFiles/kdostartupconfig5.dir/kdostartupconfig.cpp.o
[ 44%] Building CXX object startkde/kstartupconfig/CMakeFiles/kdostartupconfig5.dir/kdostartupconfig5_automoc.cpp.o
Linking CXX shared module kded_statusnotifierwatcher.so
Scanning dependencies of target kstartupconfig5
[ 44%] [ 44%] Building CXX object startkde/kstartupconfig/CMakeFiles/kstartupconfig5.dir/kstartupconfig.cpp.o
Built target kded_statusnotifierwatcher
Linking CXX executable ksplashqml
Scanning dependencies of target ksyncdbusenv
[ 44%] Building CXX object startkde/ksyncdbusenv/CMakeFiles/ksyncdbusenv.dir/ksyncdbusenv.cpp.o
[ 44%] Linking CXX static library libscreenlocker_static.a
Building CXX object startkde/kstartupconfig/CMakeFiles/kstartupconfig5.dir/kstartupconfig5_automoc.cpp.o
Linking CXX executable kstartupconfig5
[ 44%] Building CXX object startkde/ksyncdbusenv/CMakeFiles/ksyncdbusenv.dir/ksyncdbusenv_automoc.cpp.o
[ 44%] Building CXX object startkde/kcminit/CMakeFiles/kdeinit_kcminit_startup.dir/klauncher_iface.cpp.o
[ 44%] Built target screenlocker_static
[ 44%] [ 44%] Built target kstartupconfig5
[ 44%] Building CXX object startkde/kcminit/CMakeFiles/kdeinit_kcminit_startup.dir/kdeinit_kcminit_startup_automoc.cpp.o
Generating screensaver_interface.cpp, screensaver_interface.h
[ 44%] [ 44%] Built target ksplashqml
Generating krunner_interface.cpp, krunner_interface.h
<http://build.kde.org/job/plasma-workspace_master_qt5/ws/startkde/kcminit/main.cpp>: In member function ‘bool KCMInit::runModule(const QString&, KService::Ptr)’:
<http://build.kde.org/job/plasma-workspace_master_qt5/ws/startkde/kcminit/main.cpp>:68:25: warning: ‘KLibrary’ is deprecated (declared at /srv/jenkins/install/linux/x86_64/g++/kf5-qt5/frameworks/kdelibs4support/inst/include/KF5/KDELibs4Support/klibrary.h:37) [-Wdeprecated-declarations]
     KLibrary lib(libName);
                         ^
<http://build.kde.org/job/plasma-workspace_master_qt5/ws/startkde/kcminit/main.cpp>:82:92: warning: ‘void (* KLibrary::resolveFunction(const char*))()’ is deprecated (declared at /srv/jenkins/install/linux/x86_64/g++/kf5-qt5/frameworks/kdelibs4support/inst/include/KF5/KDELibs4Support/klibrary.h:66) [-Wdeprecated-declarations]
         KLibrary::void_function_ptr init = lib.resolveFunction(kcminit.toUtf8().constData());
                                                                                            ^
<http://build.kde.org/job/plasma-workspace_master_qt5/ws/startkde/kcminit/main.cpp>: At global scope:
<http://build.kde.org/job/plasma-workspace_master_qt5/ws/startkde/kcminit/main.cpp>:137:38: warning: ‘KCmdLineArgs’ is deprecated (declared at /srv/jenkins/install/linux/x86_64/g++/kf5-qt5/frameworks/kdelibs4support/inst/include/KF5/KDELibs4Support/kcmdlineargs.h:286) [-Wdeprecated-declarations]
 KCMInit::KCMInit( KCmdLineArgs* args )
                                      ^
<http://build.kde.org/job/plasma-workspace_master_qt5/ws/startkde/kcminit/main.cpp>: In function ‘int kdemain(int, char**)’:
<http://build.kde.org/job/plasma-workspace_master_qt5/ws/startkde/kcminit/main.cpp>:249:24: warning: ‘K4AboutData’ is deprecated (declared at /srv/jenkins/install/linux/x86_64/g++/kf5-qt5/frameworks/kdelibs4support/inst/include/KF5/KDELibs4Support/k4aboutdata.h:199) [-Wdeprecated-declarations]
   K4AboutData aboutData( "kcminit", "kcminit", ki18n("KCMInit"),
                        ^
<http://build.kde.org/job/plasma-workspace_master_qt5/ws/startkde/kcminit/main.cpp>:255:19: warning: ‘KCmdLineOptions’ is deprecated (declared at /srv/jenkins/install/linux/x86_64/g++/kf5-qt5/frameworks/kdelibs4support/inst/include/KF5/KDELibs4Support/kcmdlineargs.h:53) [-Wdeprecated-declarations]
   KCmdLineOptions options;
                   ^
<http://build.kde.org/job/plasma-workspace_master_qt5/ws/startkde/kcminit/main.cpp>:260:16: warning: ‘KApplication’ is deprecated (declared at /srv/jenkins/install/linux/x86_64/g++/kf5-qt5/frameworks/kdelibs4support/inst/include/KF5/KDELibs4Support/kapplication.h:76) [-Wdeprecated-declarations]
   KApplication app;
                ^
[ 44%] Scanning dependencies of target plasma_containmentactions_switchdesktop
[ 44%] Building CXX object containmentactions/switchdesktop/CMakeFiles/plasma_containmentactions_switchdesktop.dir/desktop.cpp.o
Generating krunner_interface.moc
[ 44%] Generating screensaver_interface.moc
Scanning dependencies of target plasma_containmentactions_contextmenu
[ 45%] Building CXX object containmentactions/contextmenu/CMakeFiles/plasma_containmentactions_contextmenu.dir/menu.cpp.o
[ 45%] Building CXX object containmentactions/switchdesktop/CMakeFiles/plasma_containmentactions_switchdesktop.dir/plasma_containmentactions_switchdesktop_automoc.cpp.o
Linking CXX shared library libkdeinit5_kcminit.so
Linking CXX executable kdostartupconfig5
<http://build.kde.org/job/plasma-workspace_master_qt5/ws/startkde/kcminit/main.cpp>: In member function ‘bool KCMInit::runModule(const QString&, KService::Ptr)’:
<http://build.kde.org/job/plasma-workspace_master_qt5/ws/startkde/kcminit/main.cpp>:68:25: warning: ‘KLibrary’ is deprecated (declared at /srv/jenkins/install/linux/x86_64/g++/kf5-qt5/frameworks/kdelibs4support/inst/include/KF5/KDELibs4Support/klibrary.h:37) [-Wdeprecated-declarations]
     KLibrary lib(libName);
                         ^
<http://build.kde.org/job/plasma-workspace_master_qt5/ws/startkde/kcminit/main.cpp>:82:92: warning: ‘void (* KLibrary::resolveFunction(const char*))()’ is deprecated (declared at /srv/jenkins/install/linux/x86_64/g++/kf5-qt5/frameworks/kdelibs4support/inst/include/KF5/KDELibs4Support/klibrary.h:66) [-Wdeprecated-declarations]
         KLibrary::void_function_ptr init = lib.resolveFunction(kcminit.toUtf8().constData());
                                                                                            ^
<http://build.kde.org/job/plasma-workspace_master_qt5/ws/startkde/kcminit/main.cpp>: At global scope:
<http://build.kde.org/job/plasma-workspace_master_qt5/ws/startkde/kcminit/main.cpp>:137:38: warning: ‘KCmdLineArgs’ is deprecated (declared at /srv/jenkins/install/linux/x86_64/g++/kf5-qt5/frameworks/kdelibs4support/inst/include/KF5/KDELibs4Support/kcmdlineargs.h:286) [-Wdeprecated-declarations]
 KCMInit::KCMInit( KCmdLineArgs* args )
                                      ^
<http://build.kde.org/job/plasma-workspace_master_qt5/ws/startkde/kcminit/main.cpp>: In function ‘int kdemain(int, char**)’:
<http://build.kde.org/job/plasma-workspace_master_qt5/ws/startkde/kcminit/main.cpp>:249:24: warning: ‘K4AboutData’ is deprecated (declared at /srv/jenkins/install/linux/x86_64/g++/kf5-qt5/frameworks/kdelibs4support/inst/include/KF5/KDELibs4Support/k4aboutdata.h:199) [-Wdeprecated-declarations]
   K4AboutData aboutData( "kcminit", "kcminit", ki18n("KCMInit"),
                        ^
<http://build.kde.org/job/plasma-workspace_master_qt5/ws/startkde/kcminit/main.cpp>:255:19: warning: ‘KCmdLineOptions’ is deprecated (declared at /srv/jenkins/install/linux/x86_64/g++/kf5-qt5/frameworks/kdelibs4support/inst/include/KF5/KDELibs4Support/kcmdlineargs.h:53) [-Wdeprecated-declarations]
   KCmdLineOptions options;
                   ^
<http://build.kde.org/job/plasma-workspace_master_qt5/ws/startkde/kcminit/main.cpp>:260:16: warning: ‘KApplication’ is deprecated (declared at /srv/jenkins/install/linux/x86_64/g++/kf5-qt5/frameworks/kdelibs4support/inst/include/KF5/KDELibs4Support/kapplication.h:76) [-Wdeprecated-declarations]
   KApplication app;
                ^
[ 45%] Built target kdostartupconfig5
[ 45%] Building CXX object containmentactions/contextmenu/CMakeFiles/plasma_containmentactions_contextmenu.dir/krunner_interface.cpp.o
Linking CXX executable ksyncdbusenv
[ 45%] Built target kdeinit_kcminit
[ 45%] Building CXX object containmentactions/contextmenu/CMakeFiles/plasma_containmentactions_contextmenu.dir/screensaver_interface.cpp.o
[ 45%] Built target ksyncdbusenv
Scanning dependencies of target plasma_containmentactions_switchactivity
[ 45%] Building CXX object containmentactions/contextmenu/CMakeFiles/plasma_containmentactions_contextmenu.dir/plasma_containmentactions_contextmenu_automoc.cpp.o
[ 45%] Building CXX object containmentactions/switchactivity/CMakeFiles/plasma_containmentactions_switchactivity.dir/switch.cpp.o
Scanning dependencies of target plasma_containmentactions_paste
[ 45%] Building CXX object containmentactions/paste/CMakeFiles/plasma_containmentactions_paste.dir/paste.cpp.o
[ 45%] Generating ui_config.h
Linking CXX shared module plasma_containmentactions_switchdesktop.so
Scanning dependencies of target plasma_containmentactions_switchwindow
[ 45%] Building CXX object containmentactions/switchwindow/CMakeFiles/plasma_containmentactions_switchwindow.dir/switch.cpp.o
Linking CXX shared library libkdeinit5_kcminit_startup.so
[ 45%] Built target plasma_containmentactions_switchdesktop
[ 45%] Building CXX object containmentactions/switchwindow/CMakeFiles/plasma_containmentactions_switchwindow.dir/plasma_containmentactions_switchwindow_automoc.cpp.o
[ 45%] Building CXX object containmentactions/switchactivity/CMakeFiles/plasma_containmentactions_switchactivity.dir/plasma_containmentactions_switchactivity_automoc.cpp.o
[ 45%] Built target kdeinit_kcminit_startup
[ 45%] Building CXX object containmentactions/paste/CMakeFiles/plasma_containmentactions_paste.dir/plasma_containmentactions_paste_automoc.cpp.o
Scanning dependencies of target plasma_containmentactions_applauncher
[ 46%] Building CXX object containmentactions/applauncher/CMakeFiles/plasma_containmentactions_applauncher.dir/launch.cpp.o
Scanning dependencies of target plasma_containmentactions_minimalcontextmenu
[ 46%] Building CXX object containmentactions/minimalcontextmenu/CMakeFiles/plasma_containmentactions_minimalcontextmenu.dir/menu.cpp.o
Scanning dependencies of target kcm_splashscreen
Linking CXX shared module plasma_containmentactions_contextmenu.so
[ 46%] Building CXX object kcms/splash/CMakeFiles/kcm_splashscreen.dir/kcm.cpp.o
[ 46%] [ 46%] Built target plasma_containmentactions_contextmenu
[ 46%] Building CXX object containmentactions/minimalcontextmenu/CMakeFiles/plasma_containmentactions_minimalcontextmenu.dir/plasma_containmentactions_minimalcontextmenu_automoc.cpp.o
Building CXX object kcms/splash/CMakeFiles/kcm_splashscreen.dir/kcm_splashscreen_automoc.cpp.o
Linking CXX shared module plasma_containmentactions_paste.so
Linking CXX shared module plasma_containmentactions_switchactivity.so
[ 46%] Built target plasma_containmentactions_paste
[ 46%] Building CXX object containmentactions/applauncher/CMakeFiles/plasma_containmentactions_applauncher.dir/plasma_containmentactions_applauncher_automoc.cpp.o
[ 46%] Built target plasma_containmentactions_switchactivity
Linking CXX shared module plasma_containmentactions_switchwindow.so
Scanning dependencies of target krunner_activities
[ 46%] Building CXX object runners/activities/CMakeFiles/krunner_activities.dir/activityrunner.cpp.o
Scanning dependencies of target krunner_baloosearchrunner
[ 46%] Building CXX object runners/baloo/CMakeFiles/krunner_baloosearchrunner.dir/baloosearchrunner.cpp.o
[ 46%] Built target plasma_containmentactions_switchwindow
[ 46%] Building CXX object runners/baloo/CMakeFiles/krunner_baloosearchrunner.dir/krunner_baloosearchrunner_automoc.cpp.o
<http://build.kde.org/job/plasma-workspace_master_qt5/ws/runners/baloo/baloosearchrunner.cpp>:31:23: fatal error: Baloo/Query: No such file or directory
 #include <Baloo/Query>
                       ^
compilation terminated.
make[2]: *** [runners/baloo/CMakeFiles/krunner_baloosearchrunner.dir/baloosearchrunner.cpp.o] Error 1
make[2]: *** Waiting for unfinished jobs....
[ 47%] Building CXX object runners/activities/CMakeFiles/krunner_activities.dir/krunner_activities_automoc.cpp.o
Scanning dependencies of target krunner_bookmarksrunner
[ 47%] Building CXX object runners/bookmarks/CMakeFiles/krunner_bookmarksrunner.dir/browserfactory.cpp.o
[ 47%] Building CXX object runners/bookmarks/CMakeFiles/krunner_bookmarksrunner.dir/bookmarkmatch.cpp.o
Linking CXX shared module plasma_containmentactions_minimalcontextmenu.so
[ 47%] Built target plasma_containmentactions_minimalcontextmenu
[ 48%] Building CXX object runners/bookmarks/CMakeFiles/krunner_bookmarksrunner.dir/faviconfromblob.cpp.o
Scanning dependencies of target testChromeBookmarks
[ 48%] Building CXX object runners/bookmarks/tests/CMakeFiles/testChromeBookmarks.dir/testchromebookmarks.cpp.o
Linking CXX shared module plasma_containmentactions_applauncher.so
[ 48%] Built target plasma_containmentactions_applauncher
[ 48%] [ 48%] Building CXX object runners/bookmarks/tests/CMakeFiles/testChromeBookmarks.dir/__/browsers/chrome.cpp.o
Building CXX object runners/bookmarks/CMakeFiles/krunner_bookmarksrunner.dir/favicon.cpp.o
make[1]: *** [runners/baloo/CMakeFiles/krunner_baloosearchrunner.dir/all] Error 2
make[1]: *** Waiting for unfinished jobs....
[ 48%] Building CXX object runners/bookmarks/CMakeFiles/krunner_bookmarksrunner.dir/fetchsqlite.cpp.o
[ 49%] Building CXX object runners/bookmarks/tests/CMakeFiles/testChromeBookmarks.dir/__/faviconfromblob.cpp.o
[ 49%] Linking CXX shared module kcm_splashscreen.so
Building CXX object runners/bookmarks/CMakeFiles/krunner_bookmarksrunner.dir/browsers/opera.cpp.o
Linking CXX shared module krunner_activities.so
[ 49%] Built target kcm_splashscreen
[ 49%] Building CXX object runners/bookmarks/CMakeFiles/krunner_bookmarksrunner.dir/bookmarksrunner.cpp.o
[ 49%] Built target krunner_activities
[ 49%] Building CXX object runners/bookmarks/CMakeFiles/krunner_bookmarksrunner.dir/browsers/kdebrowser.cpp.o
[ 49%] [ 49%] Building CXX object runners/bookmarks/CMakeFiles/krunner_bookmarksrunner.dir/browsers/chromefindprofile.cpp.o
Building CXX object runners/bookmarks/CMakeFiles/krunner_bookmarksrunner.dir/browsers/firefox.cpp.o
[ 50%] Building CXX object runners/bookmarks/CMakeFiles/krunner_bookmarksrunner.dir/browsers/chrome.cpp.o
[ 50%] Building CXX object runners/bookmarks/tests/CMakeFiles/testChromeBookmarks.dir/__/browsers/chromefindprofile.cpp.o
[ 50%] Building CXX object runners/bookmarks/tests/CMakeFiles/testChromeBookmarks.dir/__/bookmarkmatch.cpp.o
[ 50%] Building CXX object runners/bookmarks/CMakeFiles/krunner_bookmarksrunner.dir/krunner_bookmarksrunner_automoc.cpp.o
[ 50%] Building CXX object runners/bookmarks/tests/CMakeFiles/testChromeBookmarks.dir/__/favicon.cpp.o
<http://build.kde.org/job/plasma-workspace_master_qt5/ws/runners/bookmarks/bookmarksrunner.cpp>: In member function ‘virtual void BookmarksRunner::run(const Plasma::RunnerContext&, const Plasma::QueryMatch&)’:
<http://build.kde.org/job/plasma-workspace_master_qt5/ws/runners/bookmarks/bookmarksrunner.cpp>:132:45: warning: ‘static void KToolInvocation::invokeBrowser(const QString&, const QByteArray&)’ is deprecated (declared at /srv/jenkins/install/linux/x86_64/g++/kf5-qt5/frameworks/kservice/inst/include/KF5/KService/ktoolinvocation.h:146) [-Wdeprecated-declarations]
     KToolInvocation::invokeBrowser(url.url());
                                             ^
[ 50%] Building CXX object runners/bookmarks/tests/CMakeFiles/testChromeBookmarks.dir/__/fetchsqlite.cpp.o
[ 50%] Building CXX object runners/bookmarks/tests/CMakeFiles/testChromeBookmarks.dir/testChromeBookmarks_automoc.cpp.o
Linking CXX shared module krunner_bookmarksrunner.so
[ 50%] Built target krunner_bookmarksrunner
Linking CXX executable testChromeBookmarks
[ 50%] Built target testChromeBookmarks
make: *** [all] Error 2
Compiliation step exited with non-zero code, assuming failure to build from source for project plasma-workspace.
Build step 'Execute shell' marked build as failure
[WARNINGS] Skipping publisher since build result is FAILURE
Recording test results


More information about the Plasma-devel mailing list