[KPhotoAlbum] New snapshot + message freeze

Eugene Nine enine at ninefamily.com
Sat Dec 9 21:35:34 GMT 2006

On Saturday 09 December 2006 08:41, Jesper K. Pedersen wrote:
> A new snapshot has just been released, and at the same time, this means
> that KPhotoAlbum just have entered message freeze. No new feature, no new
> message strings, no minor tiny bugfixes, no, now it is almost time for a
> release party.
> This does at the same time mean that everyone who have the slightest
> understanding of how to use a compiler should install this snapshot, so
> we can get as many bugs out of the way while waiting for the translators to
> do their magic.
> Cheers
> Jesper.

I get a syntax error

/usr/lib/qt/bin/moc ./SettingsDialog.h -o SettingsDialog.moc
if /bin/sh ../../libtool --silent --tag=CXX --mode=compile g++ -DHAVE_CONFIG_H 
-I. -I. -I../.. -I./.. -I/opt/kde/include -I/usr/lib/qt/include 
-I/usr/X11R6/include   -DQT_THREAD_SUPPORT  -D_REENTRANT  -Wno-long-long 
-Wundef -ansi -D_XOPEN_SOURCE=500 -D_BSD_SOURCE -Wcast-align -Wconversion 
-Wchar-subscripts -Wall -W -Wpointer-arith -O2 -Wformat-security 
-Wmissing-format-attribute -Wno-non-virtual-dtor -fno-exceptions 
-fno-check-new -fno-common -DQT_CLEAN_NAMESPACE -DQT_NO_ASCII_CAST 
".deps/SettingsDialog.Tpo" -c -o SettingsDialog.lo SettingsDialog.cpp; \
then mv -f ".deps/SettingsDialog.Tpo" ".deps/SettingsDialog.Plo"; else rm -f 
".deps/SettingsDialog.Tpo"; exit 1; fi
SettingsDialog.cpp: In member function `void
SettingsDialog.cpp:888: error: syntax error before `::' token
make[3]: *** [SettingsDialog.lo] Error 1
make[3]: Leaving directory 
make[2]: *** [all-recursive] Error 1
make[2]: Leaving directory `/home/enine/kphotoalbum-2006-12-09-noi18n/src'
make[1]: *** [all-recursive] Error 1
make[1]: Leaving directory `/home/enine/kphotoalbum-2006-12-09-noi18n'
make: *** [all] Error 2

More information about the Kphotoalbum mailing list