OSX/CI: kdevelop build failure on branch framework

Marko Käning mk-lists at email.de
Mon Aug 4 20:12:40 BST 2014

While trying to build develop on OSX I ran into this:

[23%] Building CXX object languages/plugins/custom-definesandincludes/tests/CMakeFiles/definesandincludestest.dir/projectsgenerator.cpp.o
/Users/marko/WC/KDECI-builds/kdevelop/app/welcomepage/welcomepageview.cpp:34:10: fatal error: 'Plasma/Theme' file not found
#include <Plasma/Theme>
1 error generated.
make[2]: *** [app/CMakeFiles/kdevelop.dir/welcomepage/welcomepageview.cpp.o] Error 1
make[1]: *** [app/CMakeFiles/kdevelop.dir/all] Error 2
make[1]: *** Waiting for unfinished jobs....
13 warnings generated.

-------------- next part --------------
A non-text attachment was scrubbed...
Name: kdevelop.log.gz
Type: application/x-gzip
Size: 10737 bytes
Desc: not available
URL: <http://mail.kde.org/pipermail/kdevelop/attachments/20140804/f0b10e83/attachment.bin>

More information about the KDevelop mailing list