Kompile KDevelop

Nick Savoiu savoiu at ics.uci.edu
Tue Nov 2 21:03:22 GMT 2004

----- Original Message ----- 
From: "Amilcar do Carmo Lucas" <amilcar at ida.ing.tu-bs.de>
To: <kdevelop at kdevelop.org>
Sent: Tuesday, November 02, 2004 1:46 AM
Subject: Re: Kompile KDevelop

> On Sunday 31 October 2004 10:58, Martin Fahrendorf wrote:
> > Hi there,
> >
> > I am no nonger able to compile KDevelop (cvs KDE_3_3_BRANCH from today)
> > since about two weeks. I get the following error:
> >
> > [...]
> >
> > Is there something I can do?
> make clean
> make

I'm having a similar problem. I've updated the code from CVS over the past
few days, reconfigured and built  but no luck.

Making all in profiles
Making all in profileengine
Making all in lib
mkdir: cannot create directory `.libs': File exists
profile.cpp: In member function `QStringList&
profile.cpp:141: warning: control reaches end of non-void function
Making all in editor
make[4]: *** No rule to make target
`../../../src/profileengine/editor/libprofileeditor.la', needed by
`kdevprofileeditor'.  Stop.
make[4]: *** Waiting for unfinished jobs....
make[3]: *** [all-recursive] Error 1
make[2]: *** [all-recursive] Error 1
make[1]: *** [all-recursive] Error 1
make: *** [all] Error 2

to unsubscribe from this list send an email to kdevelop-request at kdevelop.org with the following body:
unsubscribe »your-email-address«

More information about the KDevelop mailing list