Can't compile gideon

Francesco Mezzanotte francesco.mezzanotte at
Thu Dec 6 05:27:15 GMT 2001

It's 4 days that I'm coming crazy trying to compile the new gideon.
I'm giving :
make -f Makefile.cvs
./configure --enable-gideon-qt2 
make install 

and I always get this after 5 minutes doing well:

c++ -DHAVE_CONFIG_H -I. -I../../.././parts/doctreeview -I../.. 
-I../../.././lib/interfaces -I../../.././lib/util -I/usr/local/kde/include 
-I/usr/local/qt/include -I/usr/X11R6/include   -D_REENTRANT -DINDEXER -O2 
-fno-exceptions -fno-check-new -c -o gideon_index-htdigindex.o `test -f 
htdigindex.cpp || echo '../../.././parts/doctreeview/'`htdigindex.cpp
../../.././admin/depcomp: -Wp,-MD,.deps/gideon_index-htdigindex.TPo: File o 
directory inesistente
make[3]: *** [gideon_index-htdigindex.o] Error 127
make[3]: Leaving directory 
make[2]: *** [all-recursive] Error 1
make[2]: Leaving directory `/home/zar/Desktop/kdevelop/kde22/parts'
make[1]: *** [all-recursive] Error 1
make[1]: Leaving directory `/home/zar/Desktop/kdevelop/kde22'
make: *** [all] Error 2

Can anybody help ?

Thanks in advance



to unsubscribe from this list send an email to kdevelop-request at with the following body:
unsubscribe »your-email-address«

More information about the KDevelop mailing list