I FOUND A BUG IN KDEVELOP 1.3

Pablo Tomas Borda Di Berardino pablosof at net-alliance.net.ar
Wed Dec 13 22:50:11 UTC 2000


Hello, I'm from Argentina, I found a bug in the file highlight.cpp. There
are problems with the
"definitions". When I was trying to "make" the kdevelop, an error message
jumped, it said that an "ifdef" had a bad argument. I've tried to correct
it deleting the ifdef command (because I didn't know which kind of argument
you have to put), changing the versions of my compiler, I've tried all, but
I can't find the solution. If you delette the "ifdef" another errors will
appear, like a problem with the qregion.h file and five recursive errors
like this:



In file included from highlight.cpp:6:
/usr/lib/qt-1.45/include/qregion.h:73:182: "defined" without an identifier
make[4]: *** [highlight.o] Error 1
make[4]: Leaving directory `/root/kdevelop-1.3/kdevelop/kwrite'
make[3]: *** [all-recursive] Error 1
make[3]: Leaving directory `/root/kdevelop-1.3/kdevelop/kwrite'
make[2]: *** [all-recursive] Error 1
make[2]: Leaving directory `/root/kdevelop-1.3/kdevelop'
make[1]: *** [all-recursive] Error 1
make[1]: Leaving directory `/root/kdevelop-1.3'
make: *** [all-recursive-am] Error 2


Thanks and BYE! 
Please send me a mail when you find the solution and make a patch.

     Pablo Tomas Borda Di Berardino
    (Capsule's Corporation President)
    (The biggest software corporation)

-
to unsubscribe from this list send an email to kdevelop-request at kdevelop.org with the following body:
unsubscribe »your-email-address«



More information about the KDevelop mailing list