kdk-1.2 make failure

ph.wieder ph.wieder at fz-juelich.de
Tue Dec 5 18:03:04 UTC 2000


Hi.

Tried to install KDK-1.2 (Suse 6.3, i386, gcc 2.95.2). 

Configured with:
CPPFLAGS=/usr/incude/g++ ./configure --prefix=/usr/local/kdk
--disable-kdoc2

make produced the following error message:
Making all in kdlgloader
make[3]: Entering directory
`/usr/users/zdv190/kdk-1.2/kdevelop/kdlgloader'
/bin/sh ../libtool --mode=link g++  -O2 -fno-exceptions -fno-rtti
-fno-check-new -frtti  -s -o libkdlgloader.la -rpath
/usr/users/zdv190/lib -L/usr/X11R6/lib -L/opt/kde/lib  -no-undefined
-version-info 1:0 -s kdlgldr.lo kdlgldr_itemstuff.lo kdlgptrdb.lo
-lkdeui -lkdecore -lXext -lqt -lpng -lz -lm -lXext -lX11   -lXext  -lqt
-lpng -lz -lm -lXext -lX11
rm -fr .libs/libkdlgloader.la .libs/libkdlgloader.*
.libs/libkdlgloader.*
g++ -shared  kdlgldr.lo kdlgldr_itemstuff.lo kdlgptrdb.lo 
-L/usr/X11R6/lib -L/opt/kde/lib /opt/kde/lib/libkdeui.so
/opt/kde/lib/libkdecore.so -lXext -lqt -lpng -lz -lm -lXext -lX11 -lXext
-lqt -lpng -lz -lm -lXext -lX11 -lc  -Wl,-soname -Wl,libkdlgloader.so.1
-o .libs/libkdlgloader.so.1.0.0
/usr/bin/ld: .libs/libkdlgloader.so.1.0.0: undefined versioned symbol
name clog@@GLIBC_2.1
/usr/bin/ld: failed to set dynamic section sizes: Bad value
collect2: ld returned 1 exit status
make[3]: *** [libkdlgloader.la] Error 1
make[3]: Leaving directory
`/usr/users/zdv190/kdk-1.2/kdevelop/kdlgloader'
make[2]: *** [all-recursive] Error 1
make[2]: Leaving directory `/usr/users/zdv190/kdk-1.2/kdevelop'
make[1]: *** [all-recursive-am] Error 2
make[1]: Leaving directory `/usr/users/zdv190/kdk-1.2/kdevelop'
make: *** [all-recursive] Error 1        

Thanx for help. Philipp.

-
to unsubscribe from this list send an email to kdevelop-request at kdevelop.org with the following body:
unsubscribe »your-email-address«



More information about the KDevelop mailing list