Compile error with CVS sources

Nick Savoiu savoiu at
Tue Jun 22 19:45:05 UTC 2004

Hi all,

I updated my CVS KDE sources (including kdevelop) yesterday and today from

but I keep on getting this error when making kdevelop:

>make -s
Making all in bdb
Making all in profiles
newmainwindow.cpp: In function `KDockWidget::DockPosition
newmainwindow.cpp:477: no matching function for call to `KDockWidget::
make[3]: *** [newmainwindow.o] Error 1
make[2]: *** [all-recursive] Error 1
make[1]: *** [all-recursive] Error 1
make: *** [all] Error 2

Any ideas?


More information about the KDevelop-devel mailing list