cvs compile failure (rodda ?)

Daniel Engelschalt daniel.engelschalt at
Mon Sep 9 18:41:02 UTC 2002

cvs from now:   
makewidget.cpp: In method `void MakeWidget::insertLine1(const QString &,   
makewidget.cpp:505: no match for `QString * && QCharRef'   
makewidget.cpp:505: candidates are: operator &&(bool, bool) <builtin>   
makewidget.cpp:505: parse error before `!'   
makewidget.cpp:516: confused by earlier errors, bailing out   
make[3]: *** [makewidget.lo] Error 1   
make[3]: Leaving directory `/home/kde3/updates/kdevelop/parts/outputviews'  

make[2]: *** [all-recursive] Error 1   
make[2]: Leaving directory `/home/kde3/updates/kdevelop/parts'   
make[1]: *** [all-recursive] Error 1   
make[1]: Leaving directory `/home/kde3/updates/kdevelop'   
cvs log:  
revision 1.31  
date: 2002/09/09 13:24:12;  author: rodda;  state: Exp;  lines: +1 -1  
Another bugfix to the filename-determining code. Don't append the current  
directory name if the known name already begins with a '/', ie. is already  
a fully resolved filename.  

More information about the KDevelop-devel mailing list