gideon compile fails

Daniel Engelschalt daniel.engelschalt at
Sun Jun 16 10:37:02 UTC 2002

hi eray,  
gideon compile fails here:  
make[4]: Entering directory `/home/kde3/kdevelop/parts/cppsupport/templates'

make[4]: *** No rule to make target `all'.  Stop.  
make[4]: Leaving directory `/home/kde3/kdevelop/parts/cppsupport/templates' 

make[3]: *** [all-recursive] Error 1  
make[3]: Leaving directory `/home/kde3/kdevelop/parts/cppsupport'  
make[2]: *** [all-recursive] Error 1  
make[2]: Leaving directory `/home/kde3/kdevelop/parts'  
make[1]: *** [all-recursive] Error 1  
make[1]: Leaving directory `/home/kde3/kdevelop'  
make: *** [all] Error 2  
it seems a Makefile is missing there. could you have a look at this please ?

btw: private mails with error messages sent to you are automagically
rejected - 
mmh, nice idea :) 
> Hi. This is the qmail-send program at 
> I'm afraid I wasn't able to deliver your message to the following 
> addresses. 
> This is a permanent error; I've given up. Sorry it didn't work out. 
> <erayo at>: 
> --- Below this line is a copy of the message. 

GMX - Die Kommunikationsplattform im Internet.

More information about the KDevelop-devel mailing list