make error....

W. Tasin tasin at
Mon Jan 28 11:29:02 UTC 2002


I got following error after distclean and rebuild KDevelop (KDE2) ...

ckdevaccel.cpp: In method `void CKDevAccel::disconnectItem(const QString 
&, const QObject *, const char *)':
ckdevaccel.cpp:148: warning: unused parameter `const class QObject * 
ckdevaccel.cpp:148: warning: unused parameter `const char * member'
ckdevaccel.cpp: In method `void CKDevAccel::readSettings(KConfigBase * = 
0, bool = true)':
ckdevaccel.cpp:205: no matching function for call to 
`CKDevAccel::readSettings (KConfigBase *&)'
/opt/kde3/include/kaccel.h:187: candidates are: void 
KAccel::readSettings(KConfig * = 0)
make[3]: *** [ckdevaccel.o] Error 1
make[3]: Leaving directory `/home/tasin3/kdevelop/kdevelop'
make[2]: *** [all-recursive] Error 1
make[2]: Leaving directory `/home/tasin3/kdevelop/kdevelop'
make[1]: *** [all-recursive] Error 1
make[1]: Leaving directory `/home/tasin3/kdevelop'
make: *** [all] Error 2

Sorry I have no time to have a look at it and check it also under KDE3...


The KDevelop project: tasin at []
oohhh sveglia.... il mondo e' ammalato, ma x colpa di chi.........
:-------W. Tasin, FB 04,FHM-------------------PGP-KeyID:0x7961A645----------:
<Key-Fingerprint: 1610 835F 0080 32F4 6140  6CF7 A7D0 44CD 7961A645>

More information about the KDevelop-devel mailing list