Bug in today's CVS (fwd)

Bernd Gehrmann bernd at physik.hu-berlin.de
Sun Jun 3 07:47:29 UTC 2001

Maybe a problem with --enable-final? Can anyone check this?

---------- Forwarded message ----------
Date: Sat, 2 Jun 2001 19:14:01 -0400
From: Ravikiran Rajagopal <ravi at ee.eng.ohio-state.edu>
To: bernd at kdevelop.org
Subject: Bug in today's CVS

  Today's CVS fails to compile with the following error message. If I #undef
KeyPress before the offending line, it compiles but does not link. This is
from a freshly checked out module. Kdelibs, kdebase, etc. compiled from
today's CVS too.

Could you please bounce this to the kdevelop mailing list? Also, how do I
post to the kdevelop mailing list?


/bin/sh ../../libtool --mode=compile --tag=CXX g++ -DHAVE_CONFIG_H -I. -I.
-I../.. -I/opt/kde-cvs//include -I/usr/lib/qt-2.3.0/include
-I/usr/X11R6/include  -I../../lib/util    -O2 -DNDEBUG -fno-exceptions
-fno-check-new -frtti -DNO_NEW_CODE -c libkdevkwrite_la.all_cpp.cpp
g++ -DHAVE_CONFIG_H -I. -I. -I../.. -I/opt/kde-cvs//include
-I/usr/lib/qt-2.3.0/include -I/usr/X11R6/include -I../../lib/util -O2
-DNDEBUG -fno-exceptions -fno-check-new -frtti -DNO_NEW_CODE
-Wp,-MD,.deps/libkdevkwrite_la.all_cpp.pp -c libkdevkwrite_la.all_cpp.cpp
-fPIC -DPIC -o .libs/libkdevkwrite_la.all_cpp.o
In file included from libkdevkwrite_la.all_cpp.cpp:14:
editorpart.cpp: In method `bool EditorPart::eventFilter (QObject *,
QEvent *)':
editorpart.cpp:183: parse error before `2'
editorpart.cpp:229: confused by earlier errors, bailing out
make[2]: *** [libkdevkwrite_la.all_cpp.lo] Error 1
make[2]: Leaving directory
`/par/devel/src/kde-cvs/kdevelop/lib/kwrite'make[1]: *** [install-recursive]
Error 1
make[1]: Leaving directory `/par/devel/src/kde-cvs/kdevelop/lib'
make: *** [install-recursive] Error 1


to unsubscribe from this list send an email to kdevelop-devel-request at kdevelop.org with the following body:
unsubscribe »your-email-address«

More information about the KDevelop-devel mailing list