Bug#6849: kdevelop doesn't compile on solaris

Amir Michail amichail at cse.unsw.edu.au
Fri Jul 28 02:03:41 UTC 2000

Package: kdevelop
Version: 20000726

When compiling on x86 Solaris, I get:

/bin/sh ../../../libtool --mode=compile g++ -DHAVE_CONFIG_H -I. -I.
-I../../.. -I/import/horn/1/amichail/kde2/include
-I/import/horn/1/amichail/qt/include -I/usr/openwin/include 
-I../../../kdevelop/lib  -I/usr/openwin/include
-I/import/horn/1/amichail/include -I/import/horn/1/amichail/xforms/FORMS
-fpermissive  -O2 -fno-exceptions -fno-check-new -Wall -pedantic -W
-Wpointer-arith -Wmissing-prototypes -Wwrite-strings -Wno-long-long
-fno-builtin  -c libkdevprojectmanagement_la_meta_unload.cpp
g++ -DHAVE_CONFIG_H -I. -I. -I../../..
-I/import/horn/1/amichail/qt/include -I/usr/openwin/include
-I../../../kdevelop/lib -I/usr/openwin/include
-I/import/horn/1/amichail/include -I/import/horn/1/amichail/xforms/FORMS
-fpermissive -O2 -fno-exceptions -fno-check-new -Wall -pedantic -W
-Wpointer-arith -Wmissing-prototypes -Wwrite-strings -Wno-long-long
-fno-builtin -c libkdevprojectmanagement_la_meta_unload.cpp  -fPIC -DPIC
-o .libs/libkdevprojectmanagement_la_meta_unload.o
make[3]: *** No rule to make target
`../../../kdevelop/lib/libkdevelop.la', needed by
`libkdevprojectmanagement.la.closure'.  Stop.
make[3]: Leaving directory
make[2]: *** [install-recursive] Error 1
make[2]: Leaving directory `/var/tmp/kdevelop/kdevelop/lib'
make[1]: *** [install-recursive] Error 1
make[1]: Leaving directory `/var/tmp/kdevelop/kdevelop'
make: *** [install-recursive] Error 1   

make -v gives:

  GNU Make version 3.78.1, by Richard Stallman and Roland McGrath.
Built for i386-pc-solaris2.6
Copyright (C) 1988, 89, 90, 91, 92, 93, 94, 95, 96, 97, 98, 99
        Free Software Foundation, Inc.
This is free software; see the source for copying conditions.
There is NO warranty; not even for MERCHANTABILITY or FITNESS FOR A
Report bugs to <bug-make at gnu.org>. 


More information about the KDevelop-devel mailing list