Compiling error in kdegraphics 3.1.0

Jan Drugowitsch jdrugo at
Tue Feb 4 23:30:42 GMT 2003

After downloading all kde main modules via cvs using the KDE_3_1_0_RELEASE 
branch, I get a compiling error while trying to compile kdegraphics (kdebase 
and kdelibs are already compiled). I have checked and various 
mailinglists but could not find any hint to this problem. As my C++ is not 
that good yet, I would be interested to know if anyone here couldhelp me 
resolve this problem. The error message is attached.


make[3]: Entering directory `/home/build/builds/kde/kdegraphics/kuickshow/src'
/bin/sh ../../libtool --silent --mode=link --tag=CXX g++  -Wnon-virtual-dtor 
-Wno-long-long -Wundef -Wall -pedantic -W -Wpointer-arith 
-Wmissing-prototypes -Wwrite-strings -ansi -D_XOPEN_SOURCE=500 -D_BSD_SOURCE 
-Wcast-align -Wconversion -DNDEBUG -DNO_DEBUG -O2 -O3 -march=i386 -mcpu=i686 
-fno-exceptions -fno-check-new -DQT_CLEAN_NAMESPACE -DQT_NO_ASCII_CAST 
-I/usr/X11R6/include   -o kuickshow -L/usr/X11R6/lib -L/opt/qt/lib 
-L/opt/kde/lib  -R /opt/kde/lib -R /opt/qt/lib -R /usr/X11R6/lib dummy.o -lkio -L/usr/lib -lImlib -ljpeg -ltiff -lungif -lpng -lz -lm 
-lXext -L/usr/X11R6/lib -lSM -lICE -lXext -lX11
./.libs/ undefined reference to `KIO::NetAccess::mimetype(KURL 
const &)'
collect2: ld returned 1 exit status
make[3]: *** [kuickshow] Error 1
make[3]: Leaving directory `/home/build/builds/kde/kdegraphics/kuickshow/src'
make[2]: *** [all-recursive] Error 1
make[2]: Leaving directory `/home/build/builds/kde/kdegraphics/kuickshow'
make[1]: *** [all-recursive] Error 1
make[1]: Leaving directory `/home/build/builds/kde/kdegraphics'
make: *** [all] Error 2
This message is from the kde mailing list.
Account management:
More info:

More information about the kde mailing list