[Kde-winbuild] Build error in kde/kdepim on msvc2008 in revision 1086419

kdewinbuild at googlemail.com kdewinbuild at googlemail.com
Mon Feb 8 02:27:43 CET 2010


The full log can be found here: http://winkde.org/pub/kde/ports/win32/releases/nightly/20100207/logs/log-msvc2008-kde_kdepim.txt

        c:\kde\kde-vc90\include\kcal\incidencebase.h(361) : see declaration of 'KCal::IncidenceBase::dtStartDateStr'

C:\kde\kde-vc90\include\kcal/todo.h(441) : warning C4996: 'KCal::IncidenceBase::dtStartStr': was declared deprecated

        c:\kde\kde-vc90\include\kcal\incidencebase.h(375) : see declaration of 'KCal::IncidenceBase::dtStartStr'

Linking CXX executable ..\..\..\bin\testkincidencechooser.exe

qtmain.lib(qtmain_win.obj) : MSIL .netmodule or module compiled with /GL found; restarting link with /LTCG; add /LTCG to the link command line to improve linker performance


LINK : warning LNK4075: ignoring '/INCREMENTAL' due to '/LTCG' specification


testkincidencechooser.obj : error LNK2001: unresolved external symbol "__declspec(dllimport) public: virtual __thiscall KCal::Event::~Event(void)" (__imp_??1Event at KCal@@UAE at XZ)


testkincidencechooser.obj : error LNK2001: unresolved external symbol "__declspec(dllimport) public: void __thiscall KCal::Incidence::setDescription(class QString const &)" (__imp_?setDescription at Incidence@KCal@@QAEXABVQString@@@Z)


testkincidencechooser.obj : error LNK2001: unresolved external symbol "__declspec(dllimport) public: void __thiscall KCal::Incidence::setSummary(class QString const &)" (__imp_?setSummary at Incidence@KCal@@QAEXABVQString@@@Z)


testkincidencechooser.obj : error LNK2001: unresolved external symbol "__declspec(dllimport) public: __thiscall KCal::Event::Event(void)" (__imp_??0Event at KCal@@QAE at XZ)


..\..\..\bin\testkincidencechooser.exe : fatal error LNK1120: 4 unresolved externals


LINK Pass 1 failed. with 2

command failed with exit code 2
command failed with exit code 2
command failed with exit code 2
jom 0.8.5 - empower your cores

command failed with exit code 2
emerge fatal error: while running make cmd: c:\kde\kde-vc90\bin\jom.exe
emerge fatal error: running python c:\kde\kde-vc90\emerge\portage\kde\kdepim\kdepim-20080202.py compile 


More information about the Kde-winbuild mailing list