[Kde-winbuild] Build error in win32libs-sources/poppler-src on mingw4 in revision 4ed53e3

kdewinbuild at googlemail.com kdewinbuild at googlemail.com
Sat Apr 24 13:06:36 CEST 2010


The full log can be found here: http://winkde.org/pub/kde/ports/win32/releases/nightly/20100424/logs/log-mingw4-win32libs-sources_poppler-src.txt

C:\kde\kde-mingw4\include/jconfig.h:25:1: warning: "HAVE_STDLIB_H" redefined
In file included from C:\kde\download\svn-src\poppler-src\poppler\/DCTStream.h:15,
                 from C:\kde\download\svn-src\poppler-src\poppler\Stream.cc:58:
C:\kde\kde-mingw4\build\win32libs-sources\poppler-src-0.12.4.20100222\work\mingw4-Release-gitHEAD/config.h:95:1: warning: this is the location of the previous definition
[ 29%] Building CXX object CMakeFiles/poppler.dir/poppler/UnicodeMap.cc.obj
[ 30%] Building CXX object CMakeFiles/poppler.dir/poppler/UnicodeTypeTable.cc.obj
[ 30%] Building CXX object CMakeFiles/poppler.dir/poppler/XRef.cc.obj
[ 31%] Building CXX object CMakeFiles/poppler.dir/poppler/PSOutputDev.cc.obj
[ 31%] Building CXX object CMakeFiles/poppler.dir/poppler/TextOutputDev.cc.obj
C:\kde\download\svn-src\poppler-src\poppler\TextOutputDev.cc: In member function 'void TextPage::coalesce(GBool, GBool)':
C:\kde\download\svn-src\poppler-src\poppler\TextOutputDev.cc:3039: error: 'DBL_MAX' was not declared in this scope
C:\kde\download\svn-src\poppler-src\poppler\TextOutputDev.cc:3194: error: 'DBL_MAX' was not declared in this scope
C:\kde\download\svn-src\poppler-src\poppler\TextOutputDev.cc:3195: error: 'DBL_MIN' was not declared in this scope
C:\kde\download\svn-src\poppler-src\poppler\TextOutputDev.cc:3246: error: 'DBL_MAX' was not declared in this scope
C:\kde\download\svn-src\poppler-src\poppler\TextOutputDev.cc:3247: error: 'DBL_MIN' was not declared in this scope
mingw32-make[2]: *** [CMakeFiles/poppler.dir/poppler/TextOutputDev.cc.obj] Error 1
mingw32-make[1]: *** [CMakeFiles/poppler.dir/all] Error 2
mingw32-make: *** [all] Error 2
emerge fatal error: while running make cmd: mingw32-make -j2
emerge fatal error: running python c:\kde\kde-mingw4\emerge\portage\win32libs-sources\poppler-src\poppler-src-0.12.4.20100222.py compile 


More information about the Kde-winbuild mailing list