[kde-solaris] problems compiling kdelibs-3.5

Rob Fisher slackboy at gmail.com
Mon Dec 19 01:13:03 CET 2005

I've built QT and arts, but kdelibs-3.5 is failing with:

ksycoca.cpp: In member function `bool KSycoca::openDatabase(bool)':
ksycoca.cpp:147: error: `madvise' was not declared in this scope
ksycoca.cpp:147: warning: unused variable 'madvise'
gmake[2]: *** [ksycoca.lo] Error 1
gmake[2]: Leaving directory `/home/rob/work/build/kdelibs-3.5.0/kdecore'
gmake[1]: *** [all-recursive] Error 1

This is OpenSolaris with gcc-3.4.5. Anyone got any ideas?



More information about the kde-solaris mailing list