another 3.5 compile error

Martin Koller m.koller at
Tue Aug 9 09:12:59 BST 2005

At revision 444210.

akodePlayObject_impl.cpp: In member function `virtual bool 
akodePlayObject_impl.cpp:128: error: 'class aKode::DecoderPluginHandler' has 
no member named 'openDecoder'
akodePlayObject_impl.cpp: In member function `bool 
akodePlayObject_impl.cpp:306: error: 'class aKode::Decoder' has no member 
named 'readFrame'
akodePlayObject_impl.cpp:322: warning: comparison between signed and unsigned 
integer expressions
make[2]: *** [akodePlayObject_impl.lo] Error 1

Best regards/Schöne Grüße

Martin    ()  ascii ribbon campaign - against html mail 
          /\                        - against microsoft attachments

       Some operating systems are called 'user friendly',
             Linux however is 'expert friendly'.
-------------- next part --------------
A non-text attachment was scrubbed...
Name: not available
Type: application/pgp-signature
Size: 189 bytes
Desc: not available
URL: <>
-------------- next part --------------
kde-multimedia mailing list
kde-multimedia at

More information about the kde-multimedia mailing list