[kde-freebsd] sysutils/baloo compilation failure on CURRENT
Oleg Nauman
oleg.nauman at gmail.com
Fri Jul 1 17:19:16 UTC 2016
My attempt to install sysutils/baloo from up to date port on CURRENT
results in compilation error:
[ 50%] Building CXX object
src/file/lib/CMakeFiles/baloofiles.dir/baloofiles_automoc.o
In file included from
/disk3/work/usr/ports/sysutils/baloo/work/baloo-4.14.3/src/pim/akonadiplugin/searchplugin.cpp:34:
In file included from /usr/local/include/kde4/KDE/KABC/Addressee:1:
/usr/local/include/kde4/KDE/KABC/../../kabc/addressee.h:1003:34: error: no
type named 'List' in
'KABC::Sound'; did you mean simply 'List'?
void setExtraSoundList(const KABC::Sound::List &soundList);
^~~~~~~~~~~~~~~~~
List
/usr/local/include/kde4/KDE/KABC/../../kabc/addressee.h:87:27: note: 'List'
declared here
typedef AddresseeList List;
^
/usr/local/include/kde4/KDE/KABC/../../kabc/addressee.h:1004:5: error: no
type named 'List' in
'KABC::Sound'; did you mean simply 'List'?
KABC::Sound::List extraSoundList() const;
^~~~~~~~~~~~~~~~~
List
/usr/local/include/kde4/KDE/KABC/../../kabc/addressee.h:87:27: note: 'List'
declared here
typedef AddresseeList List;
^
/usr/local/include/kde4/KDE/KABC/../../kabc/addressee.h:1007:34: error: no
type named 'List' in
'KABC::Picture'; did you mean simply 'List'?
void setExtraPhotoList(const KABC::Picture::List &pictureList);
^~~~~~~~~~~~~~~~~~~
List
/usr/local/include/kde4/KDE/KABC/../../kabc/addressee.h:87:27: note: 'List'
declared here
typedef AddresseeList List;
^
/usr/local/include/kde4/KDE/KABC/../../kabc/addressee.h:1008:5: error: no
type named 'List' in
'KABC::Picture'; did you mean simply 'List'?
KABC::Picture::List extraPhotoList() const;
^~~~~~~~~~~~~~~~~~~
List
/usr/local/include/kde4/KDE/KABC/../../kabc/addressee.h:87:27: note: 'List'
declared here
typedef AddresseeList List;
^
/usr/local/include/kde4/KDE/KABC/../../kabc/addressee.h:1011:33: error: no
type named 'List' in
'KABC::Picture'; did you mean simply 'List'?
void setExtraLogoList(const KABC::Picture::List &logoList);
^~~~~~~~~~~~~~~~~~~
List
/usr/local/include/kde4/KDE/KABC/../../kabc/addressee.h:87:27: note: 'List'
declared here
typedef AddresseeList List;
^
/usr/local/include/kde4/KDE/KABC/../../kabc/addressee.h:1012:5: error: no
type named 'List' in
'KABC::Picture'; did you mean simply 'List'?
KABC::Picture::List extraLogoList() const;
^~~~~~~~~~~~~~~~~~~
List
/usr/local/include/kde4/KDE/KABC/../../kabc/addressee.h:87:27: note: 'List'
declared here
typedef AddresseeList List;
^
6 errors generated.
gmake[3]: ***
[src/pim/akonadiplugin/CMakeFiles/akonadi_baloo_searchplugin.dir/build.make:87:
src/pim/akonadiplugin/CMakeFiles/akonadi_baloo_searchplugin.dir/searchplugin.o]
Error 1
I have the same compilation error for both i386 and amd64 CURRENT
root at desktop:/usr/ports/sysutils/baloo # pkg which
/usr/local/include/kde4/kabc/addressee.h
/usr/local/include/kde4/kabc/addressee.h was installed by package
kdepimlibs-4.14.10_2
Anyone experiencing the same issue?
-------------- next part --------------
An HTML attachment was scrubbed...
URL: <http://mail.kde.org/pipermail/kde-freebsd/attachments/20160701/6b39fb5d/attachment.html>
More information about the kde-freebsd
mailing list