Build failed in Jenkins: marble_master #758

KDE CI System null at
Sun Nov 3 13:11:31 UTC 2013

See <>


[earthwings] Directory structure reorganization

[earthwings] Move to tools/svg2pnt directory

[earthwings] Move routing_instructions to tools and provide an option to build tools

[earthwings] Abort on wrong usage

[earthwings] Build kml2kml as a tool

[earthwings] Build maptheme-previewimage as a tool

[earthwings] Build poly2kml as a tool

[earthwings] Build shp2pn2 as a tool. Adjust to API changes.

[earthwings] Build tilecreator and tilecreator-srtm2 as tools

[earthwings] Build asc2kml as a tool

[earthwings] Build constellations2kml as a tool

[earthwings] Build dateline as a tool

[earthwings] Fix crash when executing without arguments

[earthwings] Build dso2kml as a tool

[earthwings] Do nothing it dso.dat is not found

[earthwings] Build iau2kml as a tool

[earthwings] No need to link against Marble here

[earthwings] Build mapreproject as a tool

[earthwings] Build osm-addresses as a tool

[earthwings] Build osm-sisyphus as a tool

[earthwings] Build pnt2svg as a tool

[earthwings] Build pntdel as a tool

[earthwings] Build pntreplace and speaker-files as tools

[earthwings] Basic startup sanity check. Build as a tool.

[earthwings] Build merge_ts_po as a tool

[earthwings] No need for qmake anymore

[earthwings] Build svg2pnt as a tool

[earthwings] Add an option BUILD_MARBLE_EXAMPLES to build all C++ examples

[earthwings] OpenCV is not required

[earthwings] Install examples and their sources to share/apps/marble/examples

[earthwings] Don't install tools to bin/

[earthwings] Remove which was empty since 55eabb9 in 2007

[...truncated 2680 lines...]
Building CXX object tests/CMakeFiles/BookmarkManagerTest.dir/BookmarkManagerTest_automoc.o
[ 90%] Building CXX object tests/CMakeFiles/AbstractFloatItemTest.dir/AbstractFloatItemTest_automoc.o
[ 90%] Building CXX object tests/CMakeFiles/AbstractFloatItemTest.dir/AbstractFloatItemTest.o
[ 90%] Built target plasma_runner_marble
[ 90%] Building CXX object tests/CMakeFiles/BookmarkManagerTest.dir/BookmarkManagerTest.o
[ 90%] Built target TestTrack
Scanning dependencies of target GeoPolygonTest
[ 91%] Building CXX object tests/CMakeFiles/GeoPolygonTest.dir/GeoPolygonTest_automoc.o
[ 91%] Built target AbstractDataPluginTest
[ 91%] Building CXX object tests/CMakeFiles/GeoPolygonTest.dir/GeoPolygonTest.o
Scanning dependencies of target MapViewWidgetTest
[ 91%] Building CXX object tests/CMakeFiles/MapViewWidgetTest.dir/MapViewWidgetTest_automoc.o
[ 91%] Building CXX object tests/CMakeFiles/MapViewWidgetTest.dir/MapViewWidgetTest.o
Scanning dependencies of target MarbleMapTest
[ 91%] Building CXX object tests/CMakeFiles/MarbleMapTest.dir/MarbleMapTest_automoc.o
[ 91%] Building CXX object tests/CMakeFiles/MarbleMapTest.dir/MarbleMapTest.o
Scanning dependencies of target MarbleRunnerManagerTest
[ 91%] Building CXX object tests/CMakeFiles/MarbleRunnerManagerTest.dir/MarbleRunnerManagerTest_automoc.o
[ 91%] Building CXX object tests/CMakeFiles/MarbleRunnerManagerTest.dir/MarbleRunnerManagerTest.o
Linking CXX executable AbstractDataPluginModelTest
Linking CXX executable BillboardGraphicsItemTest
[ 91%] Built target AbstractDataPluginModelTest
Scanning dependencies of target MarbleWidgetSpeedTest
[ 91%] Building CXX object tests/CMakeFiles/MarbleWidgetSpeedTest.dir/MarbleWidgetSpeedTest_automoc.o
[ 91%] Built target BillboardGraphicsItemTest
[ 91%] Building CXX object tests/CMakeFiles/MarbleWidgetSpeedTest.dir/MarbleWidgetSpeedTest.o
Linking CXX executable FrameGraphicsItemTest
Scanning dependencies of target MarbleWidgetTest
[ 91%] Linking CXX executable BookmarkManagerTest
Building CXX object tests/CMakeFiles/MarbleWidgetTest.dir/MarbleWidgetTest_automoc.o
[ 91%] Building CXX object tests/CMakeFiles/MarbleWidgetTest.dir/MarbleWidgetTest.o
[ 91%] Built target FrameGraphicsItemTest
Scanning dependencies of target MercatorProjectionTest
[ 91%] Building CXX object tests/CMakeFiles/MercatorProjectionTest.dir/MercatorProjectionTest_automoc.o
[ 91%] Built target BookmarkManagerTest
Linking CXX executable MapViewWidgetTest
[ 91%] Building CXX object tests/CMakeFiles/MercatorProjectionTest.dir/MercatorProjectionTest.o
Scanning dependencies of target PlacemarkPositionProviderPluginTest
[ 91%] Building CXX object tests/CMakeFiles/PlacemarkPositionProviderPluginTest.dir/PlacemarkPositionProviderPluginTest_automoc.o
Linking CXX executable AbstractFloatItemTest
[ 91%] Building CXX object tests/CMakeFiles/PlacemarkPositionProviderPluginTest.dir/PlacemarkPositionProviderPluginTest.o
[ 91%] Built target MapViewWidgetTest
[ 91%] Built target AbstractFloatItemTest
Scanning dependencies of target PluginManagerTest
[ 91%] Building CXX object tests/CMakeFiles/PluginManagerTest.dir/PluginManagerTest_automoc.o
Scanning dependencies of target PositionTrackingTest
[ 91%] Building CXX object tests/CMakeFiles/PositionTrackingTest.dir/PositionTrackingTest_automoc.o
[ 92%] Building CXX object tests/CMakeFiles/PluginManagerTest.dir/PluginManagerTest.o
[ 92%] Building CXX object tests/CMakeFiles/PositionTrackingTest.dir/PositionTrackingTest.o
Linking CXX executable GeoPolygonTest
[ 92%] Built target GeoPolygonTest
Scanning dependencies of target QuaternionTest
[ 92%] Building CXX object tests/CMakeFiles/QuaternionTest.dir/QuaternionTest_automoc.o
Linking CXX executable MarbleMapTest
[ 92%] Building CXX object tests/CMakeFiles/QuaternionTest.dir/QuaternionTest.o
Linking CXX executable MarbleRunnerManagerTest
Linking CXX executable MarbleWidgetSpeedTest
[ 92%] Built target MarbleRunnerManagerTest
Linking CXX executable MercatorProjectionTest
[ 92%] Built target MarbleMapTest
Scanning dependencies of target RenderPluginModelTest
[ 92%] Building CXX object tests/CMakeFiles/RenderPluginModelTest.dir/RenderPluginModelTest_automoc.o
[ 92%] Building CXX object tests/CMakeFiles/RenderPluginModelTest.dir/RenderPluginModelTest.o
Scanning dependencies of target RenderPluginTest
[ 92%] Building CXX object tests/CMakeFiles/RenderPluginTest.dir/RenderPluginTest_automoc.o
Linking CXX executable PluginManagerTest
[ 93%] Building CXX object tests/CMakeFiles/RenderPluginTest.dir/RenderPluginTest.o
[ 93%] Built target MarbleWidgetSpeedTest
[ 93%] Built target MercatorProjectionTest
Scanning dependencies of target ScreenGraphicsItemTest
[ 93%] Building CXX object tests/CMakeFiles/ScreenGraphicsItemTest.dir/ScreenGraphicsItemTest_automoc.o
[ 94%] Building CXX object tests/CMakeFiles/ScreenGraphicsItemTest.dir/ScreenGraphicsItemTest.o
Scanning dependencies of target TestBalloonStyle
[ 94%] Building CXX object tests/CMakeFiles/TestBalloonStyle.dir/TestBalloonStyle_automoc.o
Linking CXX executable PlacemarkPositionProviderPluginTest
[ 94%] [ 94%] Building CXX object tests/CMakeFiles/TestBalloonStyle.dir/TestBalloonStyle.o
Built target PluginManagerTest
Linking CXX executable MarbleWidgetTest
Scanning dependencies of target TestCamera
[ 94%] Linking CXX executable PositionTrackingTest
Building CXX object tests/CMakeFiles/TestCamera.dir/TestCamera_automoc.o
[ 95%] Building CXX object tests/CMakeFiles/TestCamera.dir/TestCamera.o
[ 95%] Built target PlacemarkPositionProviderPluginTest
Scanning dependencies of target TestGeoData
[ 95%] [ 95%] Building CXX object tests/CMakeFiles/TestGeoData.dir/TestGeoData_automoc.o
Built target MarbleWidgetTest
[ 95%] Built target PositionTrackingTest
[ 95%] Building CXX object tests/CMakeFiles/TestGeoData.dir/TestGeoData.o
[ 95%] Generating qrc_TestGeoDataCopy.cxx
Scanning dependencies of target TestGeoDataCoordinates
[ 95%] Building CXX object tests/CMakeFiles/TestGeoDataCoordinates.dir/TestGeoDataCoordinates_automoc.o
[ 95%] Building CXX object tests/CMakeFiles/TestGeoDataCoordinates.dir/TestGeoDataCoordinates.o
Scanning dependencies of target TestGeoDataCopy
[ 95%] Building CXX object tests/CMakeFiles/TestGeoDataCopy.dir/TestGeoDataCopy_automoc.o
[ 95%] Building CXX object tests/CMakeFiles/TestGeoDataCopy.dir/TestGeoDataCopy.o
Linking CXX executable QuaternionTest
Linking CXX executable RenderPluginModelTest
Linking CXX executable TestBalloonStyle
[ 95%] Built target QuaternionTest
[ 95%] Built target RenderPluginModelTest
Linking CXX executable TestCamera
Linking CXX executable ScreenGraphicsItemTest
[ 95%] Built target TestBalloonStyle
Linking CXX executable TestGeoData
Linking CXX executable RenderPluginTest
[ 95%] Built target TestCamera
[ 95%] Built target ScreenGraphicsItemTest
[ 95%] Built target TestGeoData
[ 95%] Built target RenderPluginTest
[ 95%] Building CXX object tests/CMakeFiles/TestGeoDataCopy.dir/qrc_TestGeoDataCopy.o
Linking CXX executable TestGeoDataCopy
[ 95%] Built target TestGeoDataCopy
Scanning dependencies of target TestGeoSceneWriter
[ 95%] Building CXX object tests/CMakeFiles/TestGeoSceneWriter.dir/TestGeoSceneWriter_automoc.o
Scanning dependencies of target TestGeoPainter
Scanning dependencies of target TestGeoDataWriter
[ 95%] [ 95%] Building CXX object tests/CMakeFiles/TestGeoPainter.dir/TestGeoPainter_automoc.o
Building CXX object tests/CMakeFiles/TestGeoDataWriter.dir/TestGeoDataWriter_automoc.o
[ 95%] Building CXX object tests/CMakeFiles/TestGeoSceneWriter.dir/TestGeoSceneWriter.o
[ 95%] Building CXX object tests/CMakeFiles/TestGeoPainter.dir/TestGeoPainter.o
[ 95%] Building CXX object tests/CMakeFiles/TestGeoDataWriter.dir/TestGeoDataWriter.o
Scanning dependencies of target TestGroundOverlay
[ 95%] Scanning dependencies of target TestGeoDataTrack
[ 95%] Building CXX object tests/CMakeFiles/TestGroundOverlay.dir/TestGroundOverlay_automoc.o
Building CXX object tests/CMakeFiles/TestGeoDataTrack.dir/TestGeoDataTrack_automoc.o
[ 95%] Building CXX object tests/CMakeFiles/TestGroundOverlay.dir/TestGroundOverlay.o
[ 95%] Building CXX object tests/CMakeFiles/TestGeoDataTrack.dir/TestGeoDataTrack.o
Scanning dependencies of target TestGeoDataLatLonAltBox
Scanning dependencies of target TestGeoDataPack
[ 95%] [ 96%] Building CXX object tests/CMakeFiles/TestGeoDataLatLonAltBox.dir/TestGeoDataLatLonAltBox_automoc.o
Building CXX object tests/CMakeFiles/TestGeoDataPack.dir/TestGeoDataPack_automoc.o
[ 96%] Building CXX object tests/CMakeFiles/TestGeoDataLatLonAltBox.dir/TestGeoDataLatLonAltBox.o
[ 96%] Building CXX object tests/CMakeFiles/TestGeoDataPack.dir/TestGeoDataPack.o
Scanning dependencies of target TestGeoDataGeometry
[ 96%] Building CXX object tests/CMakeFiles/TestGeoDataGeometry.dir/TestGeoDataGeometry_automoc.o
[ 96%] Building CXX object tests/CMakeFiles/TestGeoDataGeometry.dir/TestGeoDataGeometry.o
<>:514:1: warning: ‘QString createDegreeString(SignType, int, int, qreal, UnitsType, SpacesType)’ defined but not used [-Wunused-function]
<>:539:1: warning: ‘QString createDegreeString(SignType, int, qreal, UnitsType, SpacesType)’ defined but not used [-Wunused-function]
Linking CXX executable TestGeoDataCoordinates
Linking CXX executable TestGroundOverlay
Linking CXX executable TestGeoPainter
Linking CXX executable TestGeoSceneWriter
[ 96%] Built target TestGeoDataCoordinates
[ 96%] Built target TestGroundOverlay
[ 96%] Built target TestGeoPainter
Scanning dependencies of target TestGxTimeSpan
Scanning dependencies of target TestGxTimeStamp
[ 97%] Building CXX object tests/CMakeFiles/TestGxTimeSpan.dir/TestGxTimeSpan_automoc.o
[ 97%] Building CXX object tests/CMakeFiles/TestGxTimeStamp.dir/TestGxTimeStamp_automoc.o
[ 97%] Built target TestGeoSceneWriter
[ 97%] Building CXX object tests/CMakeFiles/TestGxTimeStamp.dir/TestGxTimeStamp.o
Scanning dependencies of target TestLatLonQuad
[ 97%] [ 97%] Building CXX object tests/CMakeFiles/TestLatLonQuad.dir/TestLatLonQuad_automoc.o
Building CXX object tests/CMakeFiles/TestGxTimeSpan.dir/TestGxTimeSpan.o
[ 97%] Building CXX object tests/CMakeFiles/TestLatLonQuad.dir/TestLatLonQuad.o
Scanning dependencies of target TestListStyle
[ 97%] Building CXX object tests/CMakeFiles/TestListStyle.dir/TestListStyle_automoc.o
[ 97%] Building CXX object tests/CMakeFiles/TestListStyle.dir/TestListStyle.o
Linking CXX executable TestGeoDataTrack
Linking CXX executable TestGeoDataPack
Linking CXX executable TestGeoDataWriter
[ 97%] Built target TestGeoDataTrack
Linking CXX executable TestGeoDataLatLonAltBox
Scanning dependencies of target TestModel
[ 97%] Building CXX object tests/CMakeFiles/TestModel.dir/TestModel_automoc.o
[ 97%] Building CXX object tests/CMakeFiles/TestModel.dir/TestModel.o
[ 97%] Built target TestGeoDataPack
[ 97%] Built target TestGeoDataWriter
Linking CXX executable TestGeoDataGeometry
Scanning dependencies of target TestPhotoOverlay
[ 98%] Scanning dependencies of target TestNetworkLink
Building CXX object tests/CMakeFiles/TestPhotoOverlay.dir/TestPhotoOverlay_automoc.o
[ 98%] Building CXX object tests/CMakeFiles/TestNetworkLink.dir/TestNetworkLink_automoc.o
[ 98%] Building CXX object tests/CMakeFiles/TestNetworkLink.dir/TestNetworkLink.o
[ 98%] Built target TestGeoDataLatLonAltBox
Scanning dependencies of target TestScreenOverlay
[ 98%] Building CXX object tests/CMakeFiles/TestScreenOverlay.dir/TestScreenOverlay_automoc.o
[ 98%] Built target TestGeoDataGeometry
[ 98%] [ 98%] Building CXX object tests/CMakeFiles/TestScreenOverlay.dir/TestScreenOverlay.o
Building CXX object tests/CMakeFiles/TestPhotoOverlay.dir/TestPhotoOverlay.o
Scanning dependencies of target TestTimeSpan
[ 98%] Building CXX object tests/CMakeFiles/TestTimeSpan.dir/TestTimeSpan_automoc.o
Linking CXX executable TestLatLonQuad
[ 98%] Building CXX object tests/CMakeFiles/TestTimeSpan.dir/TestTimeSpan.o
Linking CXX executable TestGxTimeStamp
Linking CXX executable TestGxTimeSpan
Linking CXX executable TestListStyle
[ 98%] Built target TestLatLonQuad
[ 98%] Built target TestGxTimeStamp
Scanning dependencies of target TestTimeStamp
[ 98%] Building CXX object tests/CMakeFiles/TestTimeStamp.dir/TestTimeStamp_automoc.o
[ 98%] Built target TestGxTimeSpan
[ 98%] Building CXX object tests/CMakeFiles/TestTimeStamp.dir/TestTimeStamp.o
Scanning dependencies of target TestTour
[ 98%] [ 98%] Building CXX object tests/CMakeFiles/TestTour.dir/TestTour_automoc.o
Built target TestListStyle
Scanning dependencies of target TileIdTest
[ 98%] Building CXX object tests/CMakeFiles/TileIdTest.dir/TileIdTest_automoc.o
[ 98%] Building CXX object tests/CMakeFiles/TestTour.dir/TestTour.o
[ 98%] Building CXX object tests/CMakeFiles/TileIdTest.dir/TileIdTest.o
Scanning dependencies of target ViewportParamsTest
[ 98%] Building CXX object tests/CMakeFiles/ViewportParamsTest.dir/ViewportParamsTest_automoc.o
[ 98%] Building CXX object tests/CMakeFiles/ViewportParamsTest.dir/ViewportParamsTest.o
Linking CXX executable TestModel
Linking CXX executable TestNetworkLink
[ 98%] Built target TestModel
[ 98%] Generating QtMainWindow.moc
Linking CXX executable TestScreenOverlay
Linking CXX executable TestPhotoOverlay
[ 98%] Built target TestNetworkLink
[ 99%] Generating StackableWindow.moc
Scanning dependencies of target marble-qt
[ 99%] Building CXX object src/apps/marble-qt/CMakeFiles/marble-qt.dir/qtmain.o
[ 99%] Generating MobileMainWindow.moc
Scanning dependencies of target marble-mobile
[ 99%] Building CXX object src/apps/marble-mobile/CMakeFiles/marble-mobile.dir/main.o
[ 99%] Built target TestPhotoOverlay
[ 99%] Generating settings.h, settings.cpp
Linking CXX executable TestTimeSpan
[ 99%] Built target TestScreenOverlay
[ 99%] Building CXX object src/apps/marble-mobile/CMakeFiles/marble-mobile.dir/MobileMainWindow.o
Scanning dependencies of target marble
[ 99%] Building CXX object src/apps/marble-kde/CMakeFiles/marble.dir/marble_automoc.o
[ 99%] Built target TestTimeSpan
[ 99%] Building CXX object src/apps/marble-kde/CMakeFiles/marble.dir/kdemain.o
[ 99%] Building CXX object src/apps/marble-mobile/CMakeFiles/marble-mobile.dir/StackableWindow.o
<>:13:28: fatal error: KDE/KApplication: No such file or directory
compilation terminated.
make[2]: *** [src/apps/marble-kde/CMakeFiles/marble.dir/kdemain.o] Error 1
make[1]: *** [src/apps/marble-kde/CMakeFiles/marble.dir/all] Error 2
make[1]: *** Waiting for unfinished jobs....
[ 99%] Building CXX object src/apps/marble-qt/CMakeFiles/marble-qt.dir/QtMainWindow.o
Linking CXX executable TestTimeStamp
Linking CXX executable TestTour
[ 99%] Built target TestTimeStamp
[ 99%] Built target TestTour
Linking CXX executable TileIdTest
[ 99%] Built target TileIdTest
Linking CXX executable ViewportParamsTest
[ 99%] Built target ViewportParamsTest
Linking CXX executable marble-mobile
[ 99%] Built target marble-mobile
Linking CXX executable marble-qt
[ 99%] Built target marble-qt
make: *** [all] Error 2
Compiliation step exited with non-zero code, assuming failure to build from source for project marble.
Build step 'Execute shell' marked build as failure
[WARNINGS] Skipping publisher since build result is FAILURE
Recording test results

More information about the kde-edu mailing list