error building kdelibs

Kleag kleag at
Sat Dec 1 12:57:07 GMT 2007


Since my yesterday update, I'm not able to build kdelibs. I tried to restart 
from scratch, removing sources, build dir and install dir (except for 
qt-copy) but I still obtain the same link error:

[ 67%] Generating checkXML.1
/home/kde4/kdesvn/build/kdelibs/bin/meinproc4: symbol lookup 
error: /home/kde4/kdesvn/build/kdelibs/lib/./ undefined symbol: 
make[2]: *** [doc/checkXML/checkXML.1] Error 127
make[1]: *** [doc/checkXML/CMakeFiles/manpage.dir/all] Error 2
make: *** [all] Error 2

Any idea ?


KsirK - a turn-based strategy game for KDE

KGraphViewer - a GraphViz dot graphs viewer

More information about the kde-core-devel mailing list