[Kde-bindings] error compiling kdebindings on amd64

Scido scido at email.it
Tue Jun 7 18:56:58 UTC 2005

Hi everybody

I'm trying to compile kdebindings-3.4.1 package on amd64. I'm using deb-src 
from official mirror of kde site (i'm a kubuntu user). I use this command:

apt-get -b source kdebindings

after some time, I get this error:

make[6]: *** No rule to make target 
`../../../qtruby/rubylib/qtruby/libqtrubyinternal.la', needed by 
`korundum.la'.  Stop.
make[6]: Leaving directory 
make[5]: *** [all-recursive] Error 1
make[5]: Leaving directory 
make[4]: *** [all-recursive] Error 1
make[4]: Leaving directory 
make[3]: *** [all-recursive] Error 1
make[3]: Leaving directory 
make[2]: *** [all-recursive] Error 1
make[2]: Leaving directory 
make[1]: *** [all] Error 2
make[1]: Leaving directory 
make: *** [build-stamp] Error 2

Can I resolve this problem? is it right posting to this ML? should I contact 
the package's mantainer?


Linux User # 368882
-------------- next part --------------
A non-text attachment was scrubbed...
Name: not available
Type: application/pgp-signature
Size: 189 bytes
Desc: not available
URL: <http://mail.kde.org/pipermail/kde-bindings/attachments/20050607/b03083e0/attachment.sig>

More information about the Kde-bindings mailing list