[Digikam-users] libkdcraw problem

Gilles Caulier caulier.gilles at gmail.com
Tue Mar 30 12:51:10 CEST 2010


Fixed now. Try again

Gilles Caulier

2010/3/30 Gilles Caulier <caulier.gilles at gmail.com>:
> yes, i can reproduce this problem there too... i take a look
>
> Gilles
>
> 2010/3/30 Gandalf Lechner <gandalf.lechner at univie.ac.at>:
>> Now it works in the beginning, but fails while building
>>
>> make[2]: ***
>> [kipi-plugins/rawconverter/CMakeFiles/kipiplugin_rawconverter.dir/batchdialog.o] Fehler 1
>>
>> I'll try again later
>>
>> Gandalf
>>
>> On Die, 2010-03-30 at 10:35 +0200, Gilles Caulier wrote:
>>> yes, i'm working on (:=)))
>>>
>>> Just commited fixes this morning. checkout again all (digiKam,
>>> kipi-plugins, and libkdcraw), remove all CMakeCache.txt files from
>>> root dir and try again
>>>
>>> Gilles Caulier
>>>
>>> 2010/3/30 Gandalf Lechner <gandalf.lechner at univie.ac.at>:
>>> > Hi all,
>>> >
>>> > following the instructions on
>>> > http://www.digikam.org/drupal/download?q=download/KDE4 as usual, I
>>> > compiled and installed the kdegraphics libs (using kubuntu 10.04 beta1).
>>> > Before that, I removed all libkdcraw packages installed via the package
>>> > manager. But still, compiling digikam fails. (It used to work a couple
>>> > of days ago.) In the config output, it says
>>> >
>>> > --  libkdcraw library found.................. YES
>>> >
>>> > but also
>>> >
>>> > --  libkdcraw >= 1.0.0 library found......... NO  (optional)
>>> >
>>> > which is strange because I just installed the very newest version
>>> > available. Compilation of digikam then fails with the message
>>> >
>>> > [ .. ]
>>> > [  1%] Building CXX object
>>> > digikam/digikam/CMakeFiles/digikamcore.dir/__/libs/dimg/dimg.o
>>> > In file included
>>> > from /home/gandalf/down/svn/kde4/graphics/digikam/libs/dimg/dimg.h:42,
>>> >
>>> > from /home/gandalf/down/svn/kde4/graphics/digikam/libs/dimg/dimg.cpp:26:
>>> > /home/gandalf/down/svn/kde4/graphics/digikam/libs/dimg/drawdecoding.h:
>>> > In constructor ‘Digikam::DRawDecoding::DRawDecoding(const
>>> > KDcrawIface::RawDecodingSettings&)’:
>>> > /home/gandalf/down/svn/kde4/graphics/digikam/libs/dimg/drawdecoding.h:70: error: ‘DontStretchPixels’ was not declared in this scope
>>> > /home/gandalf/down/svn/kde4/graphics/digikam/libs/dimg/drawdecoding.h:70: error: ‘const class KDcrawIface::RawDecodingSettings’ has no member named ‘DontStretchPixels’
>>> > make[2]: ***
>>> > [digikam/digikam/CMakeFiles/digikamcore.dir/__/libs/dimg/dimg.o] Fehler
>>> > 1
>>> > make[1]: *** [digikam/digikam/CMakeFiles/digikamcore.dir/all] Fehler 2
>>> > make: *** [all] Fehler 2
>>> >
>>> >
>>> > Any idea what's wrong here?
>>> >
>>> > Best,
>>> > Gandalf
>>> >
>>> >
>>> >
>>> >
>>> >
>>> >
>>> > _______________________________________________
>>> > Digikam-users mailing list
>>> > Digikam-users at kde.org
>>> > https://mail.kde.org/mailman/listinfo/digikam-users
>>> >
>>> _______________________________________________
>>> Digikam-users mailing list
>>> Digikam-users at kde.org
>>> https://mail.kde.org/mailman/listinfo/digikam-users
>>>
>>
>>
>>
>> _______________________________________________
>> Digikam-users mailing list
>> Digikam-users at kde.org
>> https://mail.kde.org/mailman/listinfo/digikam-users
>>
>


More information about the Digikam-users mailing list