[Digikam-devel] [digikam] [Bug 329323] New: Compile time error: flandmark_detector.cpp: No such file or directory
Kristian Karl
kristian.hermann.karl at gmail.com
Sat Dec 28 16:21:14 GMT 2013
https://bugs.kde.org/show_bug.cgi?id=329323
Bug ID: 329323
Summary: Compile time error: flandmark_detector.cpp: No such
file or directory
Classification: Unclassified
Product: digikam
Version: unspecified
Platform: unspecified
OS: Linux
Status: UNCONFIRMED
Severity: normal
Priority: NOR
Component: Face Management
Assignee: digikam-devel at kde.org
Reporter: kristian.hermann.karl at gmail.com
When compiling the latest from source code on a Fedora 20 machine using KDE
4.12.0 I get:
:
:
[ 12%] Building CXX object extra/libkface/test/CMakeFiles/align.dir/align.cpp.o
/home/krikar/dev/kde/digikam/extra/libkface/test/align.cpp:48:63: fatal error:
libkface/alignment-flandmark/flandmark_detector.cpp: No such file or directory
#include "libkface/alignment-flandmark/flandmark_detector.cpp"
^
compilation terminated.
make[2]: *** [extra/libkface/test/CMakeFiles/align.dir/align.cpp.o] Error 1
make[1]: *** [extra/libkface/test/CMakeFiles/align.dir/all] Error 2
make: *** [all] Error 2
[krikar at krikar-desktop build]$
--
You are receiving this mail because:
You are the assignee for the bug.
More information about the Digikam-devel
mailing list