[Digikam-devel] [Bug 165280] New: sqlite2 component build failure

Treeve Jelbert treeve at scarlet.be
Sun Jun 29 09:07:37 BST 2008

------- You are receiving this mail because: -------
You are the assignee for the bug, or are watching the assignee.
           Summary: sqlite2 component build failure
           Product: digikam
           Version: unspecified
          Platform: Compiled Sources
        OS/Version: Linux
            Status: UNCONFIRMED
          Severity: normal
          Priority: NOR
         Component: Database
        AssignedTo: digikam-devel kde org
        ReportedBy: treeve scarlet be

Version:            (using Devel)
Installed from:    Compiled sources
Compiler:          gcc-4.3.1 
OS:                Linux

[ 21%] Building C object digikam/CMakeFiles/digikamdatabase.dir/__/libs/database/sqlite2/attach.o
In file included from /usr/src/digikam-svn/libs/database/sqlite2/attach.c:16:
/usr/src/digikam-svn/libs/database/sqlite2/sqliteInt.h:16:20: error: config.h: No such file or directory
make[2]: *** [digikam/CMakeFiles/digikamdatabase.dir/__/libs/database/sqlite2/attach.o] Error1
make[1]: *** [digikam/CMakeFiles/digikamdatabase.dir/all] Error 2

More information about the Digikam-devel mailing list