[Digikam-devel] svn compile error

Arnd Baecker arnd.baecker at web.de
Fri Sep 29 11:41:53 CEST 2006


after reading about all the nice improvements on the GPS side
I wanted to update my installation. However, get the following
error when compiling from svn:

make[2]: Entering directory
if /bin/sh ../../libtool --silent --mode=compile --tag=CXX g++
-DHAVE_CONFIG_H -I. -I. -I../.. -I../../digikam/libs/jpegutils
-I../../digikam/libs/dimg -I../../digikam/libs/dmetadata
-I../../digikam/libs/dcraw -I../../digikam/digikam -I/usr/include/kde
-I/usr/share/qt3/include -I/usr/X11R6/include
-I/home/abaecker/NBB/SOFTWARE/digikam/include  -DQT_THREAD_SUPPORT
-D_REENTRANT  -Wno-long-long -Wundef -ansi -D_XOPEN_SOURCE=500
-D_BSD_SOURCE -Wcast-align -Wconversion -Wchar-subscripts -Wall -W
-Wpointer-arith -O2 -Wformat-security -Wmissing-format-attribute
-Wno-non-virtual-dtor -fno-exceptions -fno-check-new -fno-common
digikamalbums.lo -MD -MP -MF ".deps/digikamalbums.Tpo" \
  -c -o digikamalbums.lo `test -f 'digikamalbums.cpp' || echo
'./'`digikamalbums.cpp; \
then mv -f ".deps/digikamalbums.Tpo" ".deps/digikamalbums.Plo"; \
else rm -f ".deps/digikamalbums.Tpo"; exit 1; \
digikamalbums.cpp: In member function `bool
   kio_digikamalbums::createUDSEntry(const QString&, KIO::UDSEntry&)':
digikamalbums.cpp:1153: error: `UDS_LOCAL_PATH' undeclared in namespace
make[2]: *** [digikamalbums.lo] Error 1
make[2]: Leaving directory
make[1]: *** [install-recursive] Error 1
make[1]: Leaving directory `/tmp/abaecker/digikam/graphics/digikam'
make: *** [install-recursive] Error 1

Previous compiles (approx 2 weeks ago) worked fine.

Best, Arnd

P.S. This is on debian sarge with KDE 3.3.2

More information about the Digikam-devel mailing list