<body style="font-family: Verdana, Helvetica, sans serif; font-size: 11px; color: black"><table style="font-family: Verdana, Helvetica, sans serif; font-size: 11px; color: black"><tr><td style="font-family: Verdana, Helvetica, sans serif; font-size: 11px; color: black" align="right"><img src="https://build.kde.org/static/e59dfe28/images/32x32/red.gif"></img></td><td style="font-family: Verdana, Helvetica, sans serif; font-size: 11px; color: black" valign="center"><b style="font-size: 200%;">BUILD FAILURE</b></td></tr><tr><td style="font-family: Verdana, Helvetica, sans serif; font-size: 11px; color: black">
Build URL
</td><td style="font-family: Verdana, Helvetica, sans serif; font-size: 11px; color: black"><a href="https://build.kde.org/job/Plasma/job/ksystemstats/job/kf5-qt5%20FreeBSDQt5.15/3/">https://build.kde.org/job/Plasma/job/ksystemstats/job/kf5-qt5%20FreeBSDQt5.15/3/</a></td></tr><tr><td style="font-family: Verdana, Helvetica, sans serif; font-size: 11px; color: black">
Project:
</td><td style="font-family: Verdana, Helvetica, sans serif; font-size: 11px; color: black">kf5-qt5 FreeBSDQt5.15</td></tr><tr><td style="font-family: Verdana, Helvetica, sans serif; font-size: 11px; color: black">
Date of build:
</td><td style="font-family: Verdana, Helvetica, sans serif; font-size: 11px; color: black">Thu, 13 May 2021 12:48:43 +0000</td></tr><tr><td style="font-family: Verdana, Helvetica, sans serif; font-size: 11px; color: black">
Build duration:
</td><td style="font-family: Verdana, Helvetica, sans serif; font-size: 11px; color: black">1 min 30 sec and counting</td></tr></table><br></br><table style="font-family: Verdana, Helvetica, sans serif; font-size: 11px; color: black" width="100%" cellpadding="0" cellspacing="0"><tr><td class="bg1" style="font-family: Verdana, Helvetica, sans serif; font-size: 120%; color: white; background-color: #0000C0"><b>
CONSOLE OUTPUT
</b></td></tr><tr><td class="console" style="font-family: Courier New; font-size: 11px; color: black">[...truncated 396 lines...]</td></tr><tr><td class="console" style="font-family: Courier New; font-size: 11px; color: black">[2021-05-13T12:50:11.585Z] Scanning dependencies of target ksystemstatstest_autogen</td></tr><tr><td class="console" style="font-family: Courier New; font-size: 11px; color: black">[2021-05-13T12:50:11.585Z] [ 76%] Automatic MOC for target ksystemstatstest</td></tr><tr><td class="console" style="font-family: Courier New; font-size: 11px; color: black">[2021-05-13T12:50:11.585Z] In file included from /usr/home/jenkins/workspace/Plasma/ksystemstats/kf5-qt5 FreeBSDQt5.15/plugins/cpu/freebsdcpuplugin.cpp:7:</td></tr><tr><td class="console" style="font-family: Courier New; font-size: 11px; color: black">[2021-05-13T12:50:11.585Z] In file included from /usr/home/jenkins/workspace/Plasma/ksystemstats/kf5-qt5 FreeBSDQt5.15/plugins/cpu/freebsdcpuplugin.h:10:</td></tr><tr><td class="console" style="font-family: Courier New; font-size: 11px; color: black">[2021-05-13T12:50:11.585Z] In file included from /usr/home/jenkins/workspace/Plasma/ksystemstats/kf5-qt5 FreeBSDQt5.15/plugins/cpu/cpu.h:10:</td></tr><tr><td class="console" style="font-family: Courier New; font-size: 11px; color: black">[2021-05-13T12:50:11.585Z] In file included from /usr/home/jenkins/install-prefix/include/ksysguard/systemstats/SensorObject.h:24:</td></tr><tr><td class="console" style="font-family: Courier New; font-size: 11px; color: black">[2021-05-13T12:50:11.585Z] In file included from /usr/local/include/qt5/QtCore/QObject:1:</td></tr><tr><td class="console" style="font-family: Courier New; font-size: 11px; color: black">[2021-05-13T12:50:11.585Z] In file included from /usr/local/include/qt5/QtCore/qobject.h:46:</td></tr><tr><td class="console" style="font-family: Courier New; font-size: 11px; color: black">[2021-05-13T12:50:11.585Z] In file included from /usr/local/include/qt5/QtCore/qobjectdefs.h:48:</td></tr><tr><td class="console" style="font-family: Courier New; font-size: 11px; color: black">[2021-05-13T12:50:11.585Z] In file included from /usr/local/include/qt5/QtCore/qnamespace.h:43:</td></tr><tr><td class="console" style="font-family: Courier New; font-size: 11px; color: black">[2021-05-13T12:50:11.585Z] In file included from /usr/local/include/qt5/QtCore/qglobal.h:142:</td></tr><tr><td class="console" style="font-family: Courier New; font-size: 11px; color: black">[2021-05-13T12:50:11.585Z] /usr/include/c++/v1/algorithm:1701:19: error: no viable overloaded '='</td></tr><tr><td class="console" style="font-family: Courier New; font-size: 11px; color: black">[2021-05-13T12:50:11.585Z] *__result = *__first;</td></tr><tr><td class="console" style="font-family: Courier New; font-size: 11px; color: black">[2021-05-13T12:50:11.585Z] ~~~~~~~~~ ^ ~~~~~~~~</td></tr><tr><td class="console" style="font-family: Courier New; font-size: 11px; color: black">[2021-05-13T12:50:11.585Z] /usr/include/c++/v1/algorithm:1735:23: note: in instantiation of function template specialization 'std::__1::__copy_constexpr<KSysGuard::SysctlSensor<int> *, std::__1::back_insert_iterator<QVector<SysctlSensor<int> *> > >' requested here</td></tr><tr><td class="console" style="font-family: Courier New; font-size: 11px; color: black">[2021-05-13T12:50:11.585Z] return _VSTD::__copy_constexpr(</td></tr><tr><td class="console" style="font-family: Courier New; font-size: 11px; color: black">[2021-05-13T12:50:11.585Z] ^</td></tr><tr><td class="console" style="font-family: Courier New; font-size: 11px; color: black">[2021-05-13T12:50:11.585Z] /usr/local/include/qt5/QtCore/qvector.h:577:10: note: in instantiation of function template specialization 'std::__1::copy<KSysGuard::SysctlSensor<int> *, std::__1::back_insert_iterator<QVector<SysctlSensor<int> *> > >' requested here</td></tr><tr><td class="console" style="font-family: Courier New; font-size: 11px; color: black">[2021-05-13T12:50:11.585Z] std::copy(first, last, std::back_inserter(*this));</td></tr><tr><td class="console" style="font-family: Courier New; font-size: 11px; color: black">[2021-05-13T12:50:11.585Z] ^</td></tr><tr><td class="console" style="font-family: Courier New; font-size: 11px; color: black">[2021-05-13T12:50:11.585Z] /usr/home/jenkins/workspace/Plasma/ksystemstats/kf5-qt5 FreeBSDQt5.15/plugins/cpu/freebsdcpuplugin.cpp:38:28: note: in instantiation of function template specialization 'QVector<SysctlSensor<int> *>::QVector<KSysGuard::SysctlSensor<int> *, true>' requested here</td></tr><tr><td class="console" style="font-family: Courier New; font-size: 11px; color: black">[2021-05-13T12:50:11.585Z] m_sysctlSensors.append({freq, temp});</td></tr><tr><td class="console" style="font-family: Courier New; font-size: 11px; color: black">[2021-05-13T12:50:11.585Z] ^</td></tr><tr><td class="console" style="font-family: Courier New; font-size: 11px; color: black">[2021-05-13T12:50:11.585Z] /usr/include/c++/v1/iterator:902:53: note: candidate function not viable: no known conversion from 'KSysGuard::SysctlSensor<int>' to 'const typename QVector<SysctlSensor<int> *>::value_type' (aka 'SysctlSensor<int> *const') for 1st argument</td></tr><tr><td class="console" style="font-family: Courier New; font-size: 11px; color: black">[2021-05-13T12:50:11.585Z] _LIBCPP_INLINE_VISIBILITY back_insert_iterator& operator=(const typename _Container::value_type& __value_)</td></tr><tr><td class="console" style="font-family: Courier New; font-size: 11px; color: black">[2021-05-13T12:50:11.585Z] ^</td></tr><tr><td class="console" style="font-family: Courier New; font-size: 11px; color: black">[2021-05-13T12:50:11.585Z] /usr/include/c++/v1/iterator:905:53: note: candidate function not viable: no known conversion from 'KSysGuard::SysctlSensor<int>' to 'typename QVector<SysctlSensor<int> *>::value_type' (aka 'SysctlSensor<int> *') for 1st argument</td></tr><tr><td class="console" style="font-family: Courier New; font-size: 11px; color: black">[2021-05-13T12:50:11.585Z] _LIBCPP_INLINE_VISIBILITY back_insert_iterator& operator=(typename _Container::value_type&& __value_)</td></tr><tr><td class="console" style="font-family: Courier New; font-size: 11px; color: black">[2021-05-13T12:50:11.585Z] ^</td></tr><tr><td class="console" style="font-family: Courier New; font-size: 11px; color: black">[2021-05-13T12:50:11.585Z] /usr/include/c++/v1/iterator:889:28: note: candidate function (the implicit copy assignment operator) not viable: no known conversion from 'KSysGuard::SysctlSensor<int>' to 'const std::__1::back_insert_iterator<QVector<SysctlSensor<int> *> >' for 1st argument</td></tr><tr><td class="console" style="font-family: Courier New; font-size: 11px; color: black">[2021-05-13T12:50:11.585Z] class _LIBCPP_TEMPLATE_VIS back_insert_iterator</td></tr><tr><td class="console" style="font-family: Courier New; font-size: 11px; color: black">[2021-05-13T12:50:11.585Z] ^</td></tr><tr><td class="console" style="font-family: Courier New; font-size: 11px; color: black">[2021-05-13T12:50:11.585Z] /usr/include/c++/v1/iterator:889:28: note: candidate function (the implicit move assignment operator) not viable: no known conversion from 'KSysGuard::SysctlSensor<int>' to 'std::__1::back_insert_iterator<QVector<SysctlSensor<int> *> >' for 1st argument</td></tr><tr><td class="console" style="font-family: Courier New; font-size: 11px; color: black">[2021-05-13T12:50:11.585Z] In file included from /usr/home/jenkins/workspace/Plasma/ksystemstats/kf5-qt5 FreeBSDQt5.15/plugins/cpu/freebsdcpuplugin.cpp:7:</td></tr><tr><td class="console" style="font-family: Courier New; font-size: 11px; color: black">[2021-05-13T12:50:11.585Z] In file included from /usr/home/jenkins/workspace/Plasma/ksystemstats/kf5-qt5 FreeBSDQt5.15/plugins/cpu/freebsdcpuplugin.h:10:</td></tr><tr><td class="console" style="font-family: Courier New; font-size: 11px; color: black">[2021-05-13T12:50:11.585Z] In file included from /usr/home/jenkins/workspace/Plasma/ksystemstats/kf5-qt5 FreeBSDQt5.15/plugins/cpu/cpu.h:10:</td></tr><tr><td class="console" style="font-family: Courier New; font-size: 11px; color: black">[2021-05-13T12:50:11.586Z] In file included from /usr/home/jenkins/install-prefix/include/ksysguard/systemstats/SensorObject.h:24:</td></tr><tr><td class="console" style="font-family: Courier New; font-size: 11px; color: black">[2021-05-13T12:50:11.586Z] In file included from /usr/local/include/qt5/QtCore/QObject:1:</td></tr><tr><td class="console" style="font-family: Courier New; font-size: 11px; color: black">[2021-05-13T12:50:11.586Z] In file included from /usr/local/include/qt5/QtCore/qobject.h:46:</td></tr><tr><td class="console" style="font-family: Courier New; font-size: 11px; color: black">[2021-05-13T12:50:11.586Z] In file included from /usr/local/include/qt5/QtCore/qobjectdefs.h:48:</td></tr><tr><td class="console" style="font-family: Courier New; font-size: 11px; color: black">[2021-05-13T12:50:11.586Z] In file included from /usr/local/include/qt5/QtCore/qnamespace.h:43:</td></tr><tr><td class="console" style="font-family: Courier New; font-size: 11px; color: black">[2021-05-13T12:50:11.586Z] In file included from /usr/local/include/qt5/QtCore/qglobal.h:142:</td></tr><tr><td class="console" style="font-family: Courier New; font-size: 11px; color: black">[2021-05-13T12:50:11.586Z] /usr/include/c++/v1/algorithm:1710:12: error: no matching function for call to '__copy_constexpr'</td></tr><tr><td class="console" style="font-family: Courier New; font-size: 11px; color: black">[2021-05-13T12:50:11.586Z] return __copy_constexpr(__first, __last, __result);</td></tr><tr><td class="console" style="font-family: Courier New; font-size: 11px; color: black">[2021-05-13T12:50:11.586Z] ^~~~~~~~~~~~~~~~</td></tr><tr><td class="console" style="font-family: Courier New; font-size: 11px; color: black">[2021-05-13T12:50:11.586Z] /usr/include/c++/v1/algorithm:1738:23: note: in instantiation of function template specialization 'std::__1::__copy<KSysGuard::SysctlSensor<int> *, std::__1::back_insert_iterator<QVector<SysctlSensor<int> *> > >' requested here</td></tr><tr><td class="console" style="font-family: Courier New; font-size: 11px; color: black">[2021-05-13T12:50:11.586Z] return _VSTD::__copy(</td></tr><tr><td class="console" style="font-family: Courier New; font-size: 11px; color: black">[2021-05-13T12:50:11.586Z] ^</td></tr><tr><td class="console" style="font-family: Courier New; font-size: 11px; color: black">[2021-05-13T12:50:11.586Z] /usr/local/include/qt5/QtCore/qvector.h:577:10: note: in instantiation of function template specialization 'std::__1::copy<KSysGuard::SysctlSensor<int> *, std::__1::back_insert_iterator<QVector<SysctlSensor<int> *> > >' requested here</td></tr><tr><td class="console" style="font-family: Courier New; font-size: 11px; color: black">[2021-05-13T12:50:11.586Z] std::copy(first, last, std::back_inserter(*this));</td></tr><tr><td class="console" style="font-family: Courier New; font-size: 11px; color: black">[2021-05-13T12:50:11.586Z] ^</td></tr><tr><td class="console" style="font-family: Courier New; font-size: 11px; color: black">[2021-05-13T12:50:11.586Z] /usr/home/jenkins/workspace/Plasma/ksystemstats/kf5-qt5 FreeBSDQt5.15/plugins/cpu/freebsdcpuplugin.cpp:38:28: note: in instantiation of function template specialization 'QVector<SysctlSensor<int> *>::QVector<KSysGuard::SysctlSensor<int> *, true>' requested here</td></tr><tr><td class="console" style="font-family: Courier New; font-size: 11px; color: black">[2021-05-13T12:50:11.586Z] m_sysctlSensors.append({freq, temp});</td></tr><tr><td class="console" style="font-family: Courier New; font-size: 11px; color: black">[2021-05-13T12:50:11.586Z] ^</td></tr><tr><td class="console" style="font-family: Courier New; font-size: 11px; color: black">[2021-05-13T12:50:11.586Z] /usr/include/c++/v1/__string:218:9: note: candidate function template not viable: no known conversion from 'std::__1::back_insert_iterator<QVector<SysctlSensor<int> *> >' to 'size_t' (aka 'unsigned long') for 3rd argument</td></tr><tr><td class="console" style="font-family: Courier New; font-size: 11px; color: black">[2021-05-13T12:50:11.586Z] _CharT* __copy_constexpr(_CharT* __s1, const _CharT* __s2, size_t __n) _NOEXCEPT</td></tr><tr><td class="console" style="font-family: Courier New; font-size: 11px; color: black">[2021-05-13T12:50:11.586Z] ^</td></tr><tr><td class="console" style="font-family: Courier New; font-size: 11px; color: black">[2021-05-13T12:50:11.843Z] /usr/include/c++/v1/algorithm:1698:1: note: candidate template ignored: substitution failure [with _InputIterator = KSysGuard::SysctlSensor<int> *, _OutputIterator = std::__1::back_insert_iterator<QVector<SysctlSensor<int> *> >]</td></tr><tr><td class="console" style="font-family: Courier New; font-size: 11px; color: black">[2021-05-13T12:50:11.843Z] __copy_constexpr(_InputIterator __first, _InputIterator __last, _OutputIterator __result)</td></tr><tr><td class="console" style="font-family: Courier New; font-size: 11px; color: black">[2021-05-13T12:50:11.843Z] ^</td></tr><tr><td class="console" style="font-family: Courier New; font-size: 11px; color: black">[2021-05-13T12:50:11.843Z] 4 errors generated.</td></tr><tr><td class="console" style="font-family: Courier New; font-size: 11px; color: black">[2021-05-13T12:50:11.843Z] gmake[2]: *** [plugins/cpu/CMakeFiles/ksystemstats_plugin_cpu.dir/build.make:134: plugins/cpu/CMakeFiles/ksystemstats_plugin_cpu.dir/freebsdcpuplugin.cpp.o] Error 1</td></tr><tr><td class="console" style="font-family: Courier New; font-size: 11px; color: black">[2021-05-13T12:50:11.843Z] gmake[1]: *** [CMakeFiles/Makefile2:742: plugins/cpu/CMakeFiles/ksystemstats_plugin_cpu.dir/all] Error 2</td></tr><tr><td class="console" style="font-family: Courier New; font-size: 11px; color: black">[2021-05-13T12:50:11.843Z] gmake[1]: *** Waiting for unfinished jobs....</td></tr><tr><td class="console" style="font-family: Courier New; font-size: 11px; color: black">[2021-05-13T12:50:11.843Z] [ 77%] Building CXX object plugins/memory/CMakeFiles/ksystemstats_plugin_memory.dir/freebsdbackend.cpp.o</td></tr><tr><td class="console" style="font-family: Courier New; font-size: 11px; color: black">[2021-05-13T12:50:12.099Z] [ 79%] Building CXX object plugins/gpu/CMakeFiles/ksystemstats_plugin_gpu.dir/LinuxNvidiaGpu.cpp.o</td></tr><tr><td class="console" style="font-family: Courier New; font-size: 11px; color: black">[2021-05-13T12:50:12.099Z] [ 80%] Building CXX object plugins/gpu/CMakeFiles/ksystemstats_plugin_gpu.dir/LinuxBackend.cpp.o</td></tr><tr><td class="console" style="font-family: Courier New; font-size: 11px; color: black">[2021-05-13T12:50:13.030Z] [ 80%] Built target ksystemstatstest_autogen</td></tr><tr><td class="console" style="font-family: Courier New; font-size: 11px; color: black">[2021-05-13T12:50:13.030Z] [ 82%] Building CXX object plugins/gpu/CMakeFiles/ksystemstats_plugin_gpu.dir/NvidiaSmiProcess.cpp.o</td></tr><tr><td class="console" style="font-family: Courier New; font-size: 11px; color: black">[2021-05-13T12:50:13.030Z] [ 84%] Building CXX object plugins/gpu/CMakeFiles/ksystemstats_plugin_gpu.dir/AllGpus.cpp.o</td></tr><tr><td class="console" style="font-family: Courier New; font-size: 11px; color: black">[2021-05-13T12:50:13.310Z] In file included from /usr/home/jenkins/workspace/Plasma/ksystemstats/kf5-qt5 FreeBSDQt5.15/plugins/memory/freebsdbackend.cpp:11:</td></tr><tr><td class="console" style="font-family: Courier New; font-size: 11px; color: black">[2021-05-13T12:50:13.310Z] /usr/home/jenkins/install-prefix/include/ksysguard/systemstats/SysctlSensor.h:22:10: error: 'SensorProperty.h' file not found with <angled> include; use "quotes" instead</td></tr><tr><td class="console" style="font-family: Courier New; font-size: 11px; color: black">[2021-05-13T12:50:13.310Z] #include <SensorProperty.h></td></tr><tr><td class="console" style="font-family: Courier New; font-size: 11px; color: black">[2021-05-13T12:50:13.310Z] ^</td></tr><tr><td class="console" style="font-family: Courier New; font-size: 11px; color: black">[2021-05-13T12:50:13.567Z] /usr/home/jenkins/workspace/Plasma/ksystemstats/kf5-qt5 FreeBSDQt5.15/plugins/memory/freebsdbackend.cpp:21:12: error: use of undeclared identifier 'sysctlbyname'</td></tr><tr><td class="console" style="font-family: Courier New; font-size: 11px; color: black">[2021-05-13T12:50:13.567Z] return sysctlbyname(name, buffer, &size, nullptr, 0) != -1;</td></tr><tr><td class="console" style="font-family: Courier New; font-size: 11px; color: black">[2021-05-13T12:50:13.567Z] ^</td></tr><tr><td class="console" style="font-family: Courier New; font-size: 11px; color: black">[2021-05-13T12:50:13.567Z] /usr/home/jenkins/workspace/Plasma/ksystemstats/kf5-qt5 FreeBSDQt5.15/plugins/memory/freebsdbackend.cpp:93:9: note: in instantiation of function template specialization 'readSysctl<unsigned int>' requested here</td></tr><tr><td class="console" style="font-family: Courier New; font-size: 11px; color: black">[2021-05-13T12:50:13.567Z] if (readSysctl("vm.stats.vm.v_active_count", &activePages) && readSysctl("vm.stats.vm.v_inactive_count", &inactivePages)) {</td></tr><tr><td class="console" style="font-family: Courier New; font-size: 11px; color: black">[2021-05-13T12:50:13.567Z] ^</td></tr><tr><td class="console" style="font-family: Courier New; font-size: 11px; color: black">[2021-05-13T12:50:13.567Z] 2 errors generated.</td></tr><tr><td class="console" style="font-family: Courier New; font-size: 11px; color: black">[2021-05-13T12:50:13.567Z] gmake[2]: *** [plugins/memory/CMakeFiles/ksystemstats_plugin_memory.dir/build.make:121: plugins/memory/CMakeFiles/ksystemstats_plugin_memory.dir/freebsdbackend.cpp.o] Error 1</td></tr><tr><td class="console" style="font-family: Courier New; font-size: 11px; color: black">[2021-05-13T12:50:13.567Z] gmake[1]: *** [CMakeFiles/Makefile2:796: plugins/memory/CMakeFiles/ksystemstats_plugin_memory.dir/all] Error 2</td></tr><tr><td class="console" style="font-family: Courier New; font-size: 11px; color: black">[2021-05-13T12:50:13.825Z] /usr/home/jenkins/workspace/Plasma/ksystemstats/kf5-qt5 FreeBSDQt5.15/plugins/gpu/LinuxBackend.cpp:20:20: warning: unused variable 'intelVendor' [-Wunused-variable]</td></tr><tr><td class="console" style="font-family: Courier New; font-size: 11px; color: black">[2021-05-13T12:50:13.825Z] static const char *intelVendor = "0x8086";</td></tr><tr><td class="console" style="font-family: Courier New; font-size: 11px; color: black">[2021-05-13T12:50:13.825Z] ^</td></tr><tr><td class="console" style="font-family: Courier New; font-size: 11px; color: black">[2021-05-13T12:50:13.825Z] [ 85%] Linking CXX shared module ../../bin/ksystemstats_plugin_osinfo.so</td></tr><tr><td class="console" style="font-family: Courier New; font-size: 11px; color: black">[2021-05-13T12:50:13.825Z] 1 warning generated.</td></tr><tr><td class="console" style="font-family: Courier New; font-size: 11px; color: black">[2021-05-13T12:50:13.825Z] [ 85%] Built target ksystemstats_plugin_osinfo</td></tr><tr><td class="console" style="font-family: Courier New; font-size: 11px; color: black">[2021-05-13T12:50:14.761Z] [ 87%] Linking CXX shared module ../../bin/ksystemstats_plugin_gpu.so</td></tr><tr><td class="console" style="font-family: Courier New; font-size: 11px; color: black">[2021-05-13T12:50:14.761Z] [ 87%] Built target ksystemstats_plugin_gpu</td></tr><tr><td class="console" style="font-family: Courier New; font-size: 11px; color: black">[2021-05-13T12:50:14.761Z] gmake: *** [Makefile:160: all] Error 2</td></tr><tr><td class="console" style="font-family: Courier New; font-size: 11px; color: black">[Pipeline] }</td></tr><tr><td class="console" style="font-family: Courier New; font-size: 11px; color: black">[Pipeline] // stage</td></tr><tr><td class="console" style="font-family: Courier New; font-size: 11px; color: black">[Pipeline] }</td></tr><tr><td class="console" style="font-family: Courier New; font-size: 11px; color: black">[2021-05-13T12:50:14.774Z] ERROR: script returned exit code 1</td></tr><tr><td class="console" style="font-family: Courier New; font-size: 11px; color: black">[Pipeline] // catchError</td></tr><tr><td class="console" style="font-family: Courier New; font-size: 11px; color: black">[Pipeline] emailextrecipients</td></tr><tr><td class="console" style="font-family: Courier New; font-size: 11px; color: black">[Pipeline] emailext</td></tr></table><br></br></body>