<body style="font-family: Verdana, Helvetica, sans serif; font-size: 11px; color: black"><table style="font-family: Verdana, Helvetica, sans serif; font-size: 11px; color: black"><tr><td style="font-family: Verdana, Helvetica, sans serif; font-size: 11px; color: black" align="right"><img src="https://build.kde.org/static/e59dfe28/images/32x32/red.gif"></img></td><td style="font-family: Verdana, Helvetica, sans serif; font-size: 11px; color: black" valign="center"><b style="font-size: 200%;">BUILD FAILURE</b></td></tr><tr><td style="font-family: Verdana, Helvetica, sans serif; font-size: 11px; color: black">
Build URL
</td><td style="font-family: Verdana, Helvetica, sans serif; font-size: 11px; color: black"><a href="https://build.kde.org/job/Plasma/job/kgamma5/job/kf5-qt5%20FreeBSDQt5.15/26/">https://build.kde.org/job/Plasma/job/kgamma5/job/kf5-qt5%20FreeBSDQt5.15/26/</a></td></tr><tr><td style="font-family: Verdana, Helvetica, sans serif; font-size: 11px; color: black">
Project:
</td><td style="font-family: Verdana, Helvetica, sans serif; font-size: 11px; color: black">kf5-qt5 FreeBSDQt5.15</td></tr><tr><td style="font-family: Verdana, Helvetica, sans serif; font-size: 11px; color: black">
Date of build:
</td><td style="font-family: Verdana, Helvetica, sans serif; font-size: 11px; color: black">Thu, 13 May 2021 08:54:19 +0000</td></tr><tr><td style="font-family: Verdana, Helvetica, sans serif; font-size: 11px; color: black">
Build duration:
</td><td style="font-family: Verdana, Helvetica, sans serif; font-size: 11px; color: black">53 sec and counting</td></tr></table><br></br><table style="font-family: Verdana, Helvetica, sans serif; font-size: 11px; color: black" width="100%" cellpadding="0" cellspacing="0"><tr><td class="bg1" style="font-family: Verdana, Helvetica, sans serif; font-size: 120%; color: white; background-color: #0000C0"><b>
CONSOLE OUTPUT
</b></td></tr><tr><td class="console" style="font-family: Courier New; font-size: 11px; color: black">[...truncated 304 lines...]</td></tr><tr><td class="console" style="font-family: Courier New; font-size: 11px; color: black">[2021-05-13T08:55:12.546Z] Scanning dependencies of target kcm_kgamma</td></tr><tr><td class="console" style="font-family: Courier New; font-size: 11px; color: black">[2021-05-13T08:55:12.546Z] [ 33%] Building CXX object kcmkgamma/CMakeFiles/kcm_kgamma.dir/kcm_kgamma_autogen/mocs_compilation.cpp.o</td></tr><tr><td class="console" style="font-family: Courier New; font-size: 11px; color: black">[2021-05-13T08:55:12.546Z] [ 66%] Building CXX object kcmkgamma/CMakeFiles/kcm_kgamma.dir/displaynumber.cpp.o</td></tr><tr><td class="console" style="font-family: Courier New; font-size: 11px; color: black">[2021-05-13T08:55:12.546Z] [ 66%] Building CXX object kcmkgamma/CMakeFiles/kcm_kgamma.dir/xf86configpath.cpp.o</td></tr><tr><td class="console" style="font-family: Courier New; font-size: 11px; color: black">[2021-05-13T08:55:12.546Z] [ 66%] Building CXX object kcmkgamma/CMakeFiles/kcm_kgamma.dir/xvidextwrap.cpp.o</td></tr><tr><td class="console" style="font-family: Courier New; font-size: 11px; color: black">[2021-05-13T08:55:12.546Z] [ 77%] Building CXX object kcmkgamma/CMakeFiles/kcm_kgamma.dir/gammactrl.cpp.o</td></tr><tr><td class="console" style="font-family: Courier New; font-size: 11px; color: black">[2021-05-13T08:55:12.546Z] [ 88%] Building CXX object kcmkgamma/CMakeFiles/kcm_kgamma.dir/kgamma.cpp.o</td></tr><tr><td class="console" style="font-family: Courier New; font-size: 11px; color: black">[2021-05-13T08:55:13.109Z] In file included from /usr/home/jenkins/workspace/Plasma/kgamma5/kf5-qt5 FreeBSDQt5.15/kcmkgamma/kgamma.cpp:7:</td></tr><tr><td class="console" style="font-family: Courier New; font-size: 11px; color: black">[2021-05-13T08:55:13.109Z] /usr/home/jenkins/workspace/Plasma/kgamma5/kf5-qt5 FreeBSDQt5.15/kcmkgamma/kgamma.h:49:9: error: use of undeclared identifier 'emit'; did you mean 'exit'?</td></tr><tr><td class="console" style="font-family: Courier New; font-size: 11px; color: black">[2021-05-13T08:55:13.109Z] emit changed(true);</td></tr><tr><td class="console" style="font-family: Courier New; font-size: 11px; color: black">[2021-05-13T08:55:13.109Z] ^~~~</td></tr><tr><td class="console" style="font-family: Courier New; font-size: 11px; color: black">[2021-05-13T08:55:13.109Z] exit</td></tr><tr><td class="console" style="font-family: Courier New; font-size: 11px; color: black">[2021-05-13T08:55:13.109Z] /usr/include/stdlib.h:97:17: note: 'exit' declared here</td></tr><tr><td class="console" style="font-family: Courier New; font-size: 11px; color: black">[2021-05-13T08:55:13.109Z] _Noreturn void exit(int);</td></tr><tr><td class="console" style="font-family: Courier New; font-size: 11px; color: black">[2021-05-13T08:55:13.109Z] ^</td></tr><tr><td class="console" style="font-family: Courier New; font-size: 11px; color: black">[2021-05-13T08:55:13.109Z] In file included from /usr/home/jenkins/workspace/Plasma/kgamma5/kf5-qt5 FreeBSDQt5.15/kcmkgamma/kgamma.cpp:7:</td></tr><tr><td class="console" style="font-family: Courier New; font-size: 11px; color: black">[2021-05-13T08:55:13.109Z] /usr/home/jenkins/workspace/Plasma/kgamma5/kf5-qt5 FreeBSDQt5.15/kcmkgamma/kgamma.h:49:13: error: expected ';' after expression</td></tr><tr><td class="console" style="font-family: Courier New; font-size: 11px; color: black">[2021-05-13T08:55:13.109Z] emit changed(true);</td></tr><tr><td class="console" style="font-family: Courier New; font-size: 11px; color: black">[2021-05-13T08:55:13.109Z] ^</td></tr><tr><td class="console" style="font-family: Courier New; font-size: 11px; color: black">[2021-05-13T08:55:13.109Z] ;</td></tr><tr><td class="console" style="font-family: Courier New; font-size: 11px; color: black">[2021-05-13T08:55:13.109Z] /usr/home/jenkins/workspace/Plasma/kgamma5/kf5-qt5 FreeBSDQt5.15/kcmkgamma/kgamma.h:49:9: warning: expression result unused [-Wunused-value]</td></tr><tr><td class="console" style="font-family: Courier New; font-size: 11px; color: black">[2021-05-13T08:55:13.109Z] emit changed(true);</td></tr><tr><td class="console" style="font-family: Courier New; font-size: 11px; color: black">[2021-05-13T08:55:13.109Z] ^~~~</td></tr><tr><td class="console" style="font-family: Courier New; font-size: 11px; color: black">[2021-05-13T08:55:13.366Z] /usr/home/jenkins/workspace/Plasma/kgamma5/kf5-qt5 FreeBSDQt5.15/kcmkgamma/gammactrl.cpp:95:9: error: use of undeclared identifier 'emit'; did you mean 'exit'?</td></tr><tr><td class="console" style="font-family: Courier New; font-size: 11px; color: black">[2021-05-13T08:55:13.366Z] emit gammaChanged(sliderpos);</td></tr><tr><td class="console" style="font-family: Courier New; font-size: 11px; color: black">[2021-05-13T08:55:13.366Z] ^~~~</td></tr><tr><td class="console" style="font-family: Courier New; font-size: 11px; color: black">[2021-05-13T08:55:13.366Z] exit</td></tr><tr><td class="console" style="font-family: Courier New; font-size: 11px; color: black">[2021-05-13T08:55:13.366Z] /usr/include/stdlib.h:97:17: note: 'exit' declared here</td></tr><tr><td class="console" style="font-family: Courier New; font-size: 11px; color: black">[2021-05-13T08:55:13.366Z] _Noreturn void exit(int);</td></tr><tr><td class="console" style="font-family: Courier New; font-size: 11px; color: black">[2021-05-13T08:55:13.366Z] ^</td></tr><tr><td class="console" style="font-family: Courier New; font-size: 11px; color: black">[2021-05-13T08:55:13.366Z] /usr/home/jenkins/workspace/Plasma/kgamma5/kf5-qt5 FreeBSDQt5.15/kcmkgamma/gammactrl.cpp:95:13: error: expected ';' after expression</td></tr><tr><td class="console" style="font-family: Courier New; font-size: 11px; color: black">[2021-05-13T08:55:13.366Z] emit gammaChanged(sliderpos);</td></tr><tr><td class="console" style="font-family: Courier New; font-size: 11px; color: black">[2021-05-13T08:55:13.366Z] ^</td></tr><tr><td class="console" style="font-family: Courier New; font-size: 11px; color: black">[2021-05-13T08:55:13.366Z] ;</td></tr><tr><td class="console" style="font-family: Courier New; font-size: 11px; color: black">[2021-05-13T08:55:13.366Z] /usr/home/jenkins/workspace/Plasma/kgamma5/kf5-qt5 FreeBSDQt5.15/kcmkgamma/gammactrl.cpp:95:9: warning: expression result unused [-Wunused-value]</td></tr><tr><td class="console" style="font-family: Courier New; font-size: 11px; color: black">[2021-05-13T08:55:13.366Z] emit gammaChanged(sliderpos);</td></tr><tr><td class="console" style="font-family: Courier New; font-size: 11px; color: black">[2021-05-13T08:55:13.366Z] ^~~~</td></tr><tr><td class="console" style="font-family: Courier New; font-size: 11px; color: black">[2021-05-13T08:55:13.366Z] In file included from /usr/home/jenkins/workspace/Plasma/kgamma5/kf5-qt5 FreeBSDQt5.15/build/kcmkgamma/kcm_kgamma_autogen/mocs_compilation.cpp:4:</td></tr><tr><td class="console" style="font-family: Courier New; font-size: 11px; color: black">[2021-05-13T08:55:13.366Z] In file included from /usr/home/jenkins/workspace/Plasma/kgamma5/kf5-qt5 FreeBSDQt5.15/build/kcmkgamma/kcm_kgamma_autogen/EWIEGA46WW/moc_kgamma.cpp:10:</td></tr><tr><td class="console" style="font-family: Courier New; font-size: 11px; color: black">[2021-05-13T08:55:13.366Z] /usr/home/jenkins/workspace/Plasma/kgamma5/kf5-qt5 FreeBSDQt5.15/build/kcmkgamma/kcm_kgamma_autogen/EWIEGA46WW/../../../../kcmkgamma/kgamma.h:49:9: error: use of undeclared identifier 'emit'; did you mean 'exit'?</td></tr><tr><td class="console" style="font-family: Courier New; font-size: 11px; color: black">[2021-05-13T08:55:13.366Z] emit changed(true);</td></tr><tr><td class="console" style="font-family: Courier New; font-size: 11px; color: black">[2021-05-13T08:55:13.366Z] ^~~~</td></tr><tr><td class="console" style="font-family: Courier New; font-size: 11px; color: black">[2021-05-13T08:55:13.366Z] exit</td></tr><tr><td class="console" style="font-family: Courier New; font-size: 11px; color: black">[2021-05-13T08:55:13.366Z] /usr/include/stdlib.h:97:17: note: 'exit' declared here</td></tr><tr><td class="console" style="font-family: Courier New; font-size: 11px; color: black">[2021-05-13T08:55:13.366Z] _Noreturn void exit(int);</td></tr><tr><td class="console" style="font-family: Courier New; font-size: 11px; color: black">[2021-05-13T08:55:13.366Z] ^</td></tr><tr><td class="console" style="font-family: Courier New; font-size: 11px; color: black">[2021-05-13T08:55:13.366Z] In file included from /usr/home/jenkins/workspace/Plasma/kgamma5/kf5-qt5 FreeBSDQt5.15/build/kcmkgamma/kcm_kgamma_autogen/mocs_compilation.cpp:4:</td></tr><tr><td class="console" style="font-family: Courier New; font-size: 11px; color: black">[2021-05-13T08:55:13.366Z] In file included from /usr/home/jenkins/workspace/Plasma/kgamma5/kf5-qt5 FreeBSDQt5.15/build/kcmkgamma/kcm_kgamma_autogen/EWIEGA46WW/moc_kgamma.cpp:10:</td></tr><tr><td class="console" style="font-family: Courier New; font-size: 11px; color: black">[2021-05-13T08:55:13.366Z] /usr/home/jenkins/workspace/Plasma/kgamma5/kf5-qt5 FreeBSDQt5.15/build/kcmkgamma/kcm_kgamma_autogen/EWIEGA46WW/../../../../kcmkgamma/kgamma.h:49:13: error: expected ';' after expression</td></tr><tr><td class="console" style="font-family: Courier New; font-size: 11px; color: black">[2021-05-13T08:55:13.366Z] emit changed(true);</td></tr><tr><td class="console" style="font-family: Courier New; font-size: 11px; color: black">[2021-05-13T08:55:13.366Z] ^</td></tr><tr><td class="console" style="font-family: Courier New; font-size: 11px; color: black">[2021-05-13T08:55:13.366Z] ;</td></tr><tr><td class="console" style="font-family: Courier New; font-size: 11px; color: black">[2021-05-13T08:55:13.366Z] /usr/home/jenkins/workspace/Plasma/kgamma5/kf5-qt5 FreeBSDQt5.15/build/kcmkgamma/kcm_kgamma_autogen/EWIEGA46WW/../../../../kcmkgamma/kgamma.h:49:9: warning: expression result unused [-Wunused-value]</td></tr><tr><td class="console" style="font-family: Courier New; font-size: 11px; color: black">[2021-05-13T08:55:13.366Z] emit changed(true);</td></tr><tr><td class="console" style="font-family: Courier New; font-size: 11px; color: black">[2021-05-13T08:55:13.366Z] ^~~~</td></tr><tr><td class="console" style="font-family: Courier New; font-size: 11px; color: black">[2021-05-13T08:55:13.366Z] 1 warning and 2 errors generated.</td></tr><tr><td class="console" style="font-family: Courier New; font-size: 11px; color: black">[2021-05-13T08:55:13.366Z] gmake[2]: *** [kcmkgamma/CMakeFiles/kcm_kgamma.dir/build.make:134: kcmkgamma/CMakeFiles/kcm_kgamma.dir/gammactrl.cpp.o] Error 1</td></tr><tr><td class="console" style="font-family: Courier New; font-size: 11px; color: black">[2021-05-13T08:55:13.366Z] gmake[2]: *** Waiting for unfinished jobs....</td></tr><tr><td class="console" style="font-family: Courier New; font-size: 11px; color: black">[2021-05-13T08:55:13.366Z] 1 warning and 2 errors generated.</td></tr><tr><td class="console" style="font-family: Courier New; font-size: 11px; color: black">[2021-05-13T08:55:13.366Z] gmake[2]: *** [kcmkgamma/CMakeFiles/kcm_kgamma.dir/build.make:82: kcmkgamma/CMakeFiles/kcm_kgamma.dir/kcm_kgamma_autogen/mocs_compilation.cpp.o] Error 1</td></tr><tr><td class="console" style="font-family: Courier New; font-size: 11px; color: black">[2021-05-13T08:55:13.621Z] /usr/home/jenkins/workspace/Plasma/kgamma5/kf5-qt5 FreeBSDQt5.15/kcmkgamma/kgamma.cpp:322:9: error: use of undeclared identifier 'emit'; did you mean 'exit'?</td></tr><tr><td class="console" style="font-family: Courier New; font-size: 11px; color: black">[2021-05-13T08:55:13.621Z] emit changed(false);</td></tr><tr><td class="console" style="font-family: Courier New; font-size: 11px; color: black">[2021-05-13T08:55:13.621Z] ^~~~</td></tr><tr><td class="console" style="font-family: Courier New; font-size: 11px; color: black">[2021-05-13T08:55:13.621Z] exit</td></tr><tr><td class="console" style="font-family: Courier New; font-size: 11px; color: black">[2021-05-13T08:55:13.621Z] /usr/include/stdlib.h:97:17: note: 'exit' declared here</td></tr><tr><td class="console" style="font-family: Courier New; font-size: 11px; color: black">[2021-05-13T08:55:13.621Z] _Noreturn void exit(int);</td></tr><tr><td class="console" style="font-family: Courier New; font-size: 11px; color: black">[2021-05-13T08:55:13.621Z] ^</td></tr><tr><td class="console" style="font-family: Courier New; font-size: 11px; color: black">[2021-05-13T08:55:13.621Z] /usr/home/jenkins/workspace/Plasma/kgamma5/kf5-qt5 FreeBSDQt5.15/kcmkgamma/kgamma.cpp:322:13: error: expected ';' after expression</td></tr><tr><td class="console" style="font-family: Courier New; font-size: 11px; color: black">[2021-05-13T08:55:13.621Z] emit changed(false);</td></tr><tr><td class="console" style="font-family: Courier New; font-size: 11px; color: black">[2021-05-13T08:55:13.621Z] ^</td></tr><tr><td class="console" style="font-family: Courier New; font-size: 11px; color: black">[2021-05-13T08:55:13.621Z] ;</td></tr><tr><td class="console" style="font-family: Courier New; font-size: 11px; color: black">[2021-05-13T08:55:13.621Z] /usr/home/jenkins/workspace/Plasma/kgamma5/kf5-qt5 FreeBSDQt5.15/kcmkgamma/kgamma.cpp:322:9: warning: expression result unused [-Wunused-value]</td></tr><tr><td class="console" style="font-family: Courier New; font-size: 11px; color: black">[2021-05-13T08:55:13.621Z] emit changed(false);</td></tr><tr><td class="console" style="font-family: Courier New; font-size: 11px; color: black">[2021-05-13T08:55:13.621Z] ^~~~</td></tr><tr><td class="console" style="font-family: Courier New; font-size: 11px; color: black">[2021-05-13T08:55:13.621Z] /usr/home/jenkins/workspace/Plasma/kgamma5/kf5-qt5 FreeBSDQt5.15/kcmkgamma/kgamma.cpp:371:9: error: use of undeclared identifier 'emit'; did you mean 'exit'?</td></tr><tr><td class="console" style="font-family: Courier New; font-size: 11px; color: black">[2021-05-13T08:55:13.621Z] emit changed(false);</td></tr><tr><td class="console" style="font-family: Courier New; font-size: 11px; color: black">[2021-05-13T08:55:13.621Z] ^~~~</td></tr><tr><td class="console" style="font-family: Courier New; font-size: 11px; color: black">[2021-05-13T08:55:13.621Z] exit</td></tr><tr><td class="console" style="font-family: Courier New; font-size: 11px; color: black">[2021-05-13T08:55:13.621Z] /usr/include/stdlib.h:97:17: note: 'exit' declared here</td></tr><tr><td class="console" style="font-family: Courier New; font-size: 11px; color: black">[2021-05-13T08:55:13.621Z] _Noreturn void exit(int);</td></tr><tr><td class="console" style="font-family: Courier New; font-size: 11px; color: black">[2021-05-13T08:55:13.621Z] ^</td></tr><tr><td class="console" style="font-family: Courier New; font-size: 11px; color: black">[2021-05-13T08:55:13.621Z] /usr/home/jenkins/workspace/Plasma/kgamma5/kf5-qt5 FreeBSDQt5.15/kcmkgamma/kgamma.cpp:371:13: error: expected ';' after expression</td></tr><tr><td class="console" style="font-family: Courier New; font-size: 11px; color: black">[2021-05-13T08:55:13.621Z] emit changed(false);</td></tr><tr><td class="console" style="font-family: Courier New; font-size: 11px; color: black">[2021-05-13T08:55:13.621Z] ^</td></tr><tr><td class="console" style="font-family: Courier New; font-size: 11px; color: black">[2021-05-13T08:55:13.621Z] ;</td></tr><tr><td class="console" style="font-family: Courier New; font-size: 11px; color: black">[2021-05-13T08:55:13.621Z] /usr/home/jenkins/workspace/Plasma/kgamma5/kf5-qt5 FreeBSDQt5.15/kcmkgamma/kgamma.cpp:371:9: warning: expression result unused [-Wunused-value]</td></tr><tr><td class="console" style="font-family: Courier New; font-size: 11px; color: black">[2021-05-13T08:55:13.621Z] emit changed(false);</td></tr><tr><td class="console" style="font-family: Courier New; font-size: 11px; color: black">[2021-05-13T08:55:13.621Z] ^~~~</td></tr><tr><td class="console" style="font-family: Courier New; font-size: 11px; color: black">[2021-05-13T08:55:13.621Z] 3 warnings and 6 errors generated.</td></tr><tr><td class="console" style="font-family: Courier New; font-size: 11px; color: black">[2021-05-13T08:55:13.621Z] gmake[2]: *** [kcmkgamma/CMakeFiles/kcm_kgamma.dir/build.make:147: kcmkgamma/CMakeFiles/kcm_kgamma.dir/kgamma.cpp.o] Error 1</td></tr><tr><td class="console" style="font-family: Courier New; font-size: 11px; color: black">[2021-05-13T08:55:13.621Z] gmake[1]: *** [CMakeFiles/Makefile2:239: kcmkgamma/CMakeFiles/kcm_kgamma.dir/all] Error 2</td></tr><tr><td class="console" style="font-family: Courier New; font-size: 11px; color: black">[2021-05-13T08:55:13.621Z] gmake: *** [Makefile:160: all] Error 2</td></tr><tr><td class="console" style="font-family: Courier New; font-size: 11px; color: black">[Pipeline] }</td></tr><tr><td class="console" style="font-family: Courier New; font-size: 11px; color: black">[Pipeline] // stage</td></tr><tr><td class="console" style="font-family: Courier New; font-size: 11px; color: black">[Pipeline] }</td></tr><tr><td class="console" style="font-family: Courier New; font-size: 11px; color: black">[2021-05-13T08:55:13.627Z] ERROR: script returned exit code 1</td></tr><tr><td class="console" style="font-family: Courier New; font-size: 11px; color: black">[Pipeline] // catchError</td></tr><tr><td class="console" style="font-family: Courier New; font-size: 11px; color: black">[Pipeline] emailextrecipients</td></tr><tr><td class="console" style="font-family: Courier New; font-size: 11px; color: black">[Pipeline] emailext</td></tr></table><br></br></body>