<body style="font-family: Verdana, Helvetica, sans serif; font-size: 11px; color: black"><table style="font-family: Verdana, Helvetica, sans serif; font-size: 11px; color: black"><tr><td style="font-family: Verdana, Helvetica, sans serif; font-size: 11px; color: black" align="right"><img src="https://build.kde.org/static/e59dfe28/images/32x32/red.gif"></img></td><td style="font-family: Verdana, Helvetica, sans serif; font-size: 11px; color: black" valign="center"><b style="font-size: 200%;">BUILD FAILURE</b></td></tr><tr><td style="font-family: Verdana, Helvetica, sans serif; font-size: 11px; color: black">
Build URL
</td><td style="font-family: Verdana, Helvetica, sans serif; font-size: 11px; color: black"><a href="https://build.kde.org/job/Plasma/job/discover/job/kf5-qt5%20SUSEQt5.15/387/">https://build.kde.org/job/Plasma/job/discover/job/kf5-qt5%20SUSEQt5.15/387/</a></td></tr><tr><td style="font-family: Verdana, Helvetica, sans serif; font-size: 11px; color: black">
Project:
</td><td style="font-family: Verdana, Helvetica, sans serif; font-size: 11px; color: black">kf5-qt5 SUSEQt5.15</td></tr><tr><td style="font-family: Verdana, Helvetica, sans serif; font-size: 11px; color: black">
Date of build:
</td><td style="font-family: Verdana, Helvetica, sans serif; font-size: 11px; color: black">Thu, 13 May 2021 11:55:47 +0000</td></tr><tr><td style="font-family: Verdana, Helvetica, sans serif; font-size: 11px; color: black">
Build duration:
</td><td style="font-family: Verdana, Helvetica, sans serif; font-size: 11px; color: black">1 min 16 sec and counting</td></tr></table><br></br><table style="font-family: Verdana, Helvetica, sans serif; font-size: 11px; color: black" width="100%" cellpadding="0" cellspacing="0"><tr><td class="bg1" style="font-family: Verdana, Helvetica, sans serif; font-size: 120%; color: white; background-color: #0000C0"><b>
CONSOLE OUTPUT
</b></td></tr><tr><td class="console" style="font-family: Courier New; font-size: 11px; color: black">[...truncated 753 lines...]</td></tr><tr><td class="console" style="font-family: Courier New; font-size: 11px; color: black">[2021-05-13T11:56:59.799Z] [ 87%] Building CXX object discover/CMakeFiles/plasma-discover.dir/discover_debug.cpp.o</td></tr><tr><td class="console" style="font-family: Courier New; font-size: 11px; color: black">[2021-05-13T11:56:59.799Z] [ 87%] Built target CategoriesTest</td></tr><tr><td class="console" style="font-family: Courier New; font-size: 11px; color: black">[2021-05-13T11:56:59.799Z] [ 88%] Building CXX object discover/CMakeFiles/plasma-discover.dir/discoversettings.cpp.o</td></tr><tr><td class="console" style="font-family: Courier New; font-size: 11px; color: black">[2021-05-13T11:56:59.799Z] In file included from /usr/include/qt5/QtCore/qobject.h:46,</td></tr><tr><td class="console" style="font-family: Courier New; font-size: 11px; color: black">[2021-05-13T11:56:59.799Z] from /usr/include/qt5/QtCore/QObject:1,</td></tr><tr><td class="console" style="font-family: Courier New; font-size: 11px; color: black">[2021-05-13T11:56:59.799Z] from /home/jenkins/workspace/Plasma/discover/kf5-qt5 SUSEQt5.15/libdiscover/resources/AbstractResourcesBackend.h:10,</td></tr><tr><td class="console" style="font-family: Courier New; font-size: 11px; color: black">[2021-05-13T11:56:59.799Z] from /home/jenkins/workspace/Plasma/discover/kf5-qt5 SUSEQt5.15/libdiscover/backends/FwupdBackend/FwupdBackend.h:11,</td></tr><tr><td class="console" style="font-family: Courier New; font-size: 11px; color: black">[2021-05-13T11:56:59.799Z] from /home/jenkins/workspace/Plasma/discover/kf5-qt5 SUSEQt5.15/libdiscover/backends/FwupdBackend/FwupdResource.h:11,</td></tr><tr><td class="console" style="font-family: Courier New; font-size: 11px; color: black">[2021-05-13T11:56:59.799Z] from /home/jenkins/workspace/Plasma/discover/kf5-qt5 SUSEQt5.15/libdiscover/backends/FwupdBackend/FwupdResource.cpp:8:</td></tr><tr><td class="console" style="font-family: Courier New; font-size: 11px; color: black">[2021-05-13T11:56:59.799Z] /usr/include/glib-2.0/gio/gdbusintrospection.h:155:25: error: expected unqualified-id before ���public���</td></tr><tr><td class="console" style="font-family: Courier New; font-size: 11px; color: black">[2021-05-13T11:56:59.799Z] 155 | GDBusSignalInfo **signals;</td></tr><tr><td class="console" style="font-family: Courier New; font-size: 11px; color: black">[2021-05-13T11:56:59.799Z] | ^~~~~~~</td></tr><tr><td class="console" style="font-family: Courier New; font-size: 11px; color: black">[2021-05-13T11:56:59.799Z] In file included from /usr/include/qt5/QtCore/qobject.h:46,</td></tr><tr><td class="console" style="font-family: Courier New; font-size: 11px; color: black">[2021-05-13T11:56:59.799Z] from /usr/include/qt5/QtCore/QObject:1,</td></tr><tr><td class="console" style="font-family: Courier New; font-size: 11px; color: black">[2021-05-13T11:56:59.799Z] from /home/jenkins/workspace/Plasma/discover/kf5-qt5 SUSEQt5.15/libdiscover/resources/AbstractResourcesBackend.h:10,</td></tr><tr><td class="console" style="font-family: Courier New; font-size: 11px; color: black">[2021-05-13T11:56:59.799Z] from /home/jenkins/workspace/Plasma/discover/kf5-qt5 SUSEQt5.15/build/libdiscover/backends/FwupdBackend/fwupd-backend_autogen/EWIEGA46WW/../../../../../../libdiscover/backends/FwupdBackend/FwupdBackend.h:11,</td></tr><tr><td class="console" style="font-family: Courier New; font-size: 11px; color: black">[2021-05-13T11:56:59.799Z] from /home/jenkins/workspace/Plasma/discover/kf5-qt5 SUSEQt5.15/build/libdiscover/backends/FwupdBackend/fwupd-backend_autogen/EWIEGA46WW/moc_FwupdBackend.cpp:10,</td></tr><tr><td class="console" style="font-family: Courier New; font-size: 11px; color: black">[2021-05-13T11:56:59.799Z] from /home/jenkins/workspace/Plasma/discover/kf5-qt5 SUSEQt5.15/build/libdiscover/backends/FwupdBackend/fwupd-backend_autogen/mocs_compilation.cpp:2:</td></tr><tr><td class="console" style="font-family: Courier New; font-size: 11px; color: black">[2021-05-13T11:56:59.799Z] /usr/include/glib-2.0/gio/gdbusintrospection.h:155:25: error: expected unqualified-id before ���public���</td></tr><tr><td class="console" style="font-family: Courier New; font-size: 11px; color: black">[2021-05-13T11:56:59.799Z] 155 | GDBusSignalInfo **signals;</td></tr><tr><td class="console" style="font-family: Courier New; font-size: 11px; color: black">[2021-05-13T11:56:59.799Z] | ^~~~~~~</td></tr><tr><td class="console" style="font-family: Courier New; font-size: 11px; color: black">[2021-05-13T11:57:00.057Z] In file included from /usr/include/qt5/QtCore/qobject.h:46,</td></tr><tr><td class="console" style="font-family: Courier New; font-size: 11px; color: black">[2021-05-13T11:57:00.057Z] from /usr/include/qt5/QtCore/QObject:1,</td></tr><tr><td class="console" style="font-family: Courier New; font-size: 11px; color: black">[2021-05-13T11:57:00.057Z] from /home/jenkins/workspace/Plasma/discover/kf5-qt5 SUSEQt5.15/libdiscover/resources/AbstractResourcesBackend.h:10,</td></tr><tr><td class="console" style="font-family: Courier New; font-size: 11px; color: black">[2021-05-13T11:57:00.057Z] from /home/jenkins/workspace/Plasma/discover/kf5-qt5 SUSEQt5.15/libdiscover/backends/FwupdBackend/FwupdBackend.h:11,</td></tr><tr><td class="console" style="font-family: Courier New; font-size: 11px; color: black">[2021-05-13T11:57:00.057Z] from /home/jenkins/workspace/Plasma/discover/kf5-qt5 SUSEQt5.15/libdiscover/backends/FwupdBackend/FwupdBackend.cpp:8:</td></tr><tr><td class="console" style="font-family: Courier New; font-size: 11px; color: black">[2021-05-13T11:57:00.057Z] /usr/include/glib-2.0/gio/gdbusintrospection.h:155:25: error: expected unqualified-id before ���public���</td></tr><tr><td class="console" style="font-family: Courier New; font-size: 11px; color: black">[2021-05-13T11:57:00.057Z] 155 | GDBusSignalInfo **signals;</td></tr><tr><td class="console" style="font-family: Courier New; font-size: 11px; color: black">[2021-05-13T11:57:00.057Z] | ^~~~~~~</td></tr><tr><td class="console" style="font-family: Courier New; font-size: 11px; color: black">[2021-05-13T11:57:00.057Z] /home/jenkins/workspace/Plasma/discover/kf5-qt5 SUSEQt5.15/libdiscover/backends/FwupdBackend/FwupdResource.cpp: In member function ���void FwupdResource::setReleaseDetails(FwupdRelease*)���:</td></tr><tr><td class="console" style="font-family: Courier New; font-size: 11px; color: black">[2021-05-13T11:57:00.057Z] /home/jenkins/workspace/Plasma/discover/kf5-qt5 SUSEQt5.15/libdiscover/backends/FwupdBackend/FwupdResource.cpp:164:66: warning: ���const gchar* fwupd_release_get_uri(FwupdRelease*)��� is deprecated: Use 'fwupd_release_get_locations' instead [-Wdeprecated-declarations]</td></tr><tr><td class="console" style="font-family: Courier New; font-size: 11px; color: black">[2021-05-13T11:57:00.057Z] 164 | m_updateURI = QString::fromUtf8(fwupd_release_get_uri(release));</td></tr><tr><td class="console" style="font-family: Courier New; font-size: 11px; color: black">[2021-05-13T11:57:00.057Z] | ^</td></tr><tr><td class="console" style="font-family: Courier New; font-size: 11px; color: black">[2021-05-13T11:57:00.057Z] In file included from /usr/include/fwupd-1/libfwupd/fwupd-device.h:12,</td></tr><tr><td class="console" style="font-family: Courier New; font-size: 11px; color: black">[2021-05-13T11:57:00.057Z] from /usr/include/fwupd-1/libfwupd/fwupd-client.h:13,</td></tr><tr><td class="console" style="font-family: Courier New; font-size: 11px; color: black">[2021-05-13T11:57:00.057Z] from /usr/include/fwupd-1/fwupd.h:16,</td></tr><tr><td class="console" style="font-family: Courier New; font-size: 11px; color: black">[2021-05-13T11:57:00.057Z] from /home/jenkins/workspace/Plasma/discover/kf5-qt5 SUSEQt5.15/libdiscover/backends/FwupdBackend/FwupdBackend.h:31,</td></tr><tr><td class="console" style="font-family: Courier New; font-size: 11px; color: black">[2021-05-13T11:57:00.057Z] from /home/jenkins/workspace/Plasma/discover/kf5-qt5 SUSEQt5.15/libdiscover/backends/FwupdBackend/FwupdResource.h:11,</td></tr><tr><td class="console" style="font-family: Courier New; font-size: 11px; color: black">[2021-05-13T11:57:00.057Z] from /home/jenkins/workspace/Plasma/discover/kf5-qt5 SUSEQt5.15/libdiscover/backends/FwupdBackend/FwupdResource.cpp:8:</td></tr><tr><td class="console" style="font-family: Courier New; font-size: 11px; color: black">[2021-05-13T11:57:00.057Z] /usr/include/fwupd-1/libfwupd/fwupd-release.h:38:14: note: declared here</td></tr><tr><td class="console" style="font-family: Courier New; font-size: 11px; color: black">[2021-05-13T11:57:00.057Z] 38 | const gchar *fwupd_release_get_uri (FwupdRelease *release);</td></tr><tr><td class="console" style="font-family: Courier New; font-size: 11px; color: black">[2021-05-13T11:57:00.057Z] | ^~~~~~~~~~~~~~~~~~~~~</td></tr><tr><td class="console" style="font-family: Courier New; font-size: 11px; color: black">[2021-05-13T11:57:00.057Z] [ 89%] Building CXX object discover/CMakeFiles/plasma-discover.dir/plasmauserfeedback.cpp.o</td></tr><tr><td class="console" style="font-family: Courier New; font-size: 11px; color: black">[2021-05-13T11:57:00.314Z] make[2]: *** [libdiscover/backends/FwupdBackend/CMakeFiles/fwupd-backend.dir/build.make:90: libdiscover/backends/FwupdBackend/CMakeFiles/fwupd-backend.dir/FwupdResource.cpp.o] Error 1</td></tr><tr><td class="console" style="font-family: Courier New; font-size: 11px; color: black">[2021-05-13T11:57:00.314Z] make[2]: *** Waiting for unfinished jobs....</td></tr><tr><td class="console" style="font-family: Courier New; font-size: 11px; color: black">[2021-05-13T11:57:00.314Z] [ 89%] Building CXX object discover/CMakeFiles/plasma-discover.dir/main.cpp.o</td></tr><tr><td class="console" style="font-family: Courier New; font-size: 11px; color: black">[2021-05-13T11:57:00.314Z] [ 89%] Built target updatedummytest</td></tr><tr><td class="console" style="font-family: Courier New; font-size: 11px; color: black">[2021-05-13T11:57:00.314Z] In file included from /usr/include/qt5/QtTest/qtest.h:45,</td></tr><tr><td class="console" style="font-family: Courier New; font-size: 11px; color: black">[2021-05-13T11:57:00.314Z] from /usr/include/qt5/QtTest/QTest:1,</td></tr><tr><td class="console" style="font-family: Courier New; font-size: 11px; color: black">[2021-05-13T11:57:00.314Z] from /home/jenkins/workspace/Plasma/discover/kf5-qt5 SUSEQt5.15/libdiscover/backends/DummyBackend/tests/DummyTest.cpp:12:</td></tr><tr><td class="console" style="font-family: Courier New; font-size: 11px; color: black">[2021-05-13T11:57:00.314Z] /home/jenkins/workspace/Plasma/discover/kf5-qt5 SUSEQt5.15/libdiscover/backends/DummyBackend/tests/DummyTest.cpp: In member function ���void DummyTest::testProxySorting()���:</td></tr><tr><td class="console" style="font-family: Courier New; font-size: 11px; color: black">[2021-05-13T11:57:00.314Z] /home/jenkins/workspace/Plasma/discover/kf5-qt5 SUSEQt5.15/libdiscover/backends/DummyBackend/tests/DummyTest.cpp:128:36: warning: ���bool QVariant::operator<=(const QVariant&) const��� is deprecated [-Wdeprecated-declarations]</td></tr><tr><td class="console" style="font-family: Courier New; font-size: 11px; color: black">[2021-05-13T11:57:00.314Z] 128 | QVERIFY(i == 0 || value <= lastRatingCount);</td></tr><tr><td class="console" style="font-family: Courier New; font-size: 11px; color: black">[2021-05-13T11:57:00.314Z] | ^~~~~~~~~~~~~~~</td></tr><tr><td class="console" style="font-family: Courier New; font-size: 11px; color: black">[2021-05-13T11:57:00.314Z] In file included from /usr/include/qt5/QtCore/qabstractitemmodel.h:43,</td></tr><tr><td class="console" style="font-family: Courier New; font-size: 11px; color: black">[2021-05-13T11:57:00.314Z] from /usr/include/qt5/QtCore/QAbstractListModel:1,</td></tr><tr><td class="console" style="font-family: Courier New; font-size: 11px; color: black">[2021-05-13T11:57:00.314Z] from /home/jenkins/workspace/Plasma/discover/kf5-qt5 SUSEQt5.15/libdiscover/ApplicationAddonsModel.h:11,</td></tr><tr><td class="console" style="font-family: Courier New; font-size: 11px; color: black">[2021-05-13T11:57:00.314Z] from /home/jenkins/workspace/Plasma/discover/kf5-qt5 SUSEQt5.15/libdiscover/backends/DummyBackend/tests/DummyTest.cpp:9:</td></tr><tr><td class="console" style="font-family: Courier New; font-size: 11px; color: black">[2021-05-13T11:57:00.314Z] /usr/include/qt5/QtCore/qvariant.h:469:31: note: declared here</td></tr><tr><td class="console" style="font-family: Courier New; font-size: 11px; color: black">[2021-05-13T11:57:00.314Z] 469 | QT_DEPRECATED inline bool operator<=(const QVariant &v) const</td></tr><tr><td class="console" style="font-family: Courier New; font-size: 11px; color: black">[2021-05-13T11:57:00.314Z] | ^~~~~~~~</td></tr><tr><td class="console" style="font-family: Courier New; font-size: 11px; color: black">[2021-05-13T11:57:00.314Z] [ 90%] Building CXX object discover/CMakeFiles/plasma-discover.dir/DiscoverObject.cpp.o</td></tr><tr><td class="console" style="font-family: Courier New; font-size: 11px; color: black">[2021-05-13T11:57:00.314Z] /home/jenkins/workspace/Plasma/discover/kf5-qt5 SUSEQt5.15/libdiscover/backends/FwupdBackend/FwupdBackend.cpp: In member function ���FwupdResource* FwupdBackend::createApp(FwupdDevice*)���:</td></tr><tr><td class="console" style="font-family: Courier New; font-size: 11px; color: black">[2021-05-13T11:57:00.314Z] /home/jenkins/workspace/Plasma/discover/kf5-qt5 SUSEQt5.15/libdiscover/backends/FwupdBackend/FwupdBackend.cpp:182:74: warning: ���const gchar* fwupd_release_get_uri(FwupdRelease*)��� is deprecated: Use 'fwupd_release_get_locations' instead [-Wdeprecated-declarations]</td></tr><tr><td class="console" style="font-family: Courier New; font-size: 11px; color: black">[2021-05-13T11:57:00.314Z] 182 | const QUrl update_uri(QString::fromUtf8(fwupd_release_get_uri(release)));</td></tr><tr><td class="console" style="font-family: Courier New; font-size: 11px; color: black">[2021-05-13T11:57:00.314Z] | ^</td></tr><tr><td class="console" style="font-family: Courier New; font-size: 11px; color: black">[2021-05-13T11:57:00.314Z] In file included from /usr/include/fwupd-1/libfwupd/fwupd-device.h:12,</td></tr><tr><td class="console" style="font-family: Courier New; font-size: 11px; color: black">[2021-05-13T11:57:00.314Z] from /usr/include/fwupd-1/libfwupd/fwupd-client.h:13,</td></tr><tr><td class="console" style="font-family: Courier New; font-size: 11px; color: black">[2021-05-13T11:57:00.314Z] from /usr/include/fwupd-1/fwupd.h:16,</td></tr><tr><td class="console" style="font-family: Courier New; font-size: 11px; color: black">[2021-05-13T11:57:00.314Z] from /home/jenkins/workspace/Plasma/discover/kf5-qt5 SUSEQt5.15/libdiscover/backends/FwupdBackend/FwupdBackend.h:31,</td></tr><tr><td class="console" style="font-family: Courier New; font-size: 11px; color: black">[2021-05-13T11:57:00.314Z] from /home/jenkins/workspace/Plasma/discover/kf5-qt5 SUSEQt5.15/libdiscover/backends/FwupdBackend/FwupdBackend.cpp:8:</td></tr><tr><td class="console" style="font-family: Courier New; font-size: 11px; color: black">[2021-05-13T11:57:00.314Z] /usr/include/fwupd-1/libfwupd/fwupd-release.h:38:14: note: declared here</td></tr><tr><td class="console" style="font-family: Courier New; font-size: 11px; color: black">[2021-05-13T11:57:00.314Z] 38 | const gchar *fwupd_release_get_uri (FwupdRelease *release);</td></tr><tr><td class="console" style="font-family: Courier New; font-size: 11px; color: black">[2021-05-13T11:57:00.314Z] | ^~~~~~~~~~~~~~~~~~~~~</td></tr><tr><td class="console" style="font-family: Courier New; font-size: 11px; color: black">[2021-05-13T11:57:00.314Z] make[2]: *** [libdiscover/backends/FwupdBackend/CMakeFiles/fwupd-backend.dir/build.make:76: libdiscover/backends/FwupdBackend/CMakeFiles/fwupd-backend.dir/fwupd-backend_autogen/mocs_compilation.cpp.o] Error 1</td></tr><tr><td class="console" style="font-family: Courier New; font-size: 11px; color: black">[2021-05-13T11:57:00.314Z] [ 91%] Building CXX object discover/CMakeFiles/plasma-discover.dir/DiscoverDeclarativePlugin.cpp.o</td></tr><tr><td class="console" style="font-family: Courier New; font-size: 11px; color: black">[2021-05-13T11:57:00.314Z] [ 91%] Built target knsbackendtest</td></tr><tr><td class="console" style="font-family: Courier New; font-size: 11px; color: black">[2021-05-13T11:57:00.314Z] [ 92%] Building CXX object discover/CMakeFiles/plasma-discover.dir/FeaturedModel.cpp.o</td></tr><tr><td class="console" style="font-family: Courier New; font-size: 11px; color: black">[2021-05-13T11:57:00.586Z] make[2]: *** [libdiscover/backends/FwupdBackend/CMakeFiles/fwupd-backend.dir/build.make:104: libdiscover/backends/FwupdBackend/CMakeFiles/fwupd-backend.dir/FwupdBackend.cpp.o] Error 1</td></tr><tr><td class="console" style="font-family: Courier New; font-size: 11px; color: black">[2021-05-13T11:57:00.586Z] make[1]: *** [CMakeFiles/Makefile2:835: libdiscover/backends/FwupdBackend/CMakeFiles/fwupd-backend.dir/all] Error 2</td></tr><tr><td class="console" style="font-family: Courier New; font-size: 11px; color: black">[2021-05-13T11:57:00.586Z] make[1]: *** Waiting for unfinished jobs....</td></tr><tr><td class="console" style="font-family: Courier New; font-size: 11px; color: black">[2021-05-13T11:57:00.586Z] [ 92%] Building CXX object discover/CMakeFiles/plasma-discover.dir/PaginateModel.cpp.o</td></tr><tr><td class="console" style="font-family: Courier New; font-size: 11px; color: black">[2021-05-13T11:57:00.586Z] [ 93%] Building CXX object discover/CMakeFiles/plasma-discover.dir/UnityLauncher.cpp.o</td></tr><tr><td class="console" style="font-family: Courier New; font-size: 11px; color: black">[2021-05-13T11:57:00.844Z] [ 94%] Building CXX object discover/CMakeFiles/plasma-discover.dir/ReadFile.cpp.o</td></tr><tr><td class="console" style="font-family: Courier New; font-size: 11px; color: black">[2021-05-13T11:57:01.101Z] [ 94%] Building CXX object discover/CMakeFiles/plasma-discover.dir/plasma-discover_autogen/EWIEGA46WW/qrc_resources.cpp.o</td></tr><tr><td class="console" style="font-family: Courier New; font-size: 11px; color: black">[2021-05-13T11:57:02.031Z] [ 95%] Linking CXX shared module ../../../bin/kns-backend.so</td></tr><tr><td class="console" style="font-family: Courier New; font-size: 11px; color: black">[2021-05-13T11:57:02.031Z] [ 96%] Linking CXX executable ../../../../bin/dummytest</td></tr><tr><td class="console" style="font-family: Courier New; font-size: 11px; color: black">[2021-05-13T11:57:02.286Z] [ 96%] Built target kns-backend</td></tr><tr><td class="console" style="font-family: Courier New; font-size: 11px; color: black">[2021-05-13T11:57:02.561Z] [ 96%] Built target dummytest</td></tr><tr><td class="console" style="font-family: Courier New; font-size: 11px; color: black">[2021-05-13T11:57:04.446Z] [ 97%] Linking CXX executable ../bin/plasma-discover</td></tr><tr><td class="console" style="font-family: Courier New; font-size: 11px; color: black">[2021-05-13T11:57:04.701Z] [ 97%] Built target plasma-discover</td></tr><tr><td class="console" style="font-family: Courier New; font-size: 11px; color: black">[2021-05-13T11:57:04.701Z] make: *** [Makefile:146: all] Error 2</td></tr><tr><td class="console" style="font-family: Courier New; font-size: 11px; color: black">[Pipeline] }</td></tr><tr><td class="console" style="font-family: Courier New; font-size: 11px; color: black">[Pipeline] // stage</td></tr><tr><td class="console" style="font-family: Courier New; font-size: 11px; color: black">[Pipeline] }</td></tr><tr><td class="console" style="font-family: Courier New; font-size: 11px; color: black">[2021-05-13T11:57:04.793Z] ERROR: script returned exit code 1</td></tr><tr><td class="console" style="font-family: Courier New; font-size: 11px; color: black">[Pipeline] // catchError</td></tr><tr><td class="console" style="font-family: Courier New; font-size: 11px; color: black">[Pipeline] emailextrecipients</td></tr><tr><td class="console" style="font-family: Courier New; font-size: 11px; color: black">[Pipeline] emailext</td></tr></table><br></br></body>